{"text_format":"1","workbook":"xlsx","n_sheets":4,"sheets":["Welcome","StockData","OutputA","OutputB"],"not_rendered":{"charts":0,"images":8,"macros":1,"external_links":0,"defined_names":38,"comments":1,"pivot_tables":0},"unopened":[],"bounds":{"document_bytes":16777216,"sheet_cells":100000,"rows_first":2000,"rows_last":500,"rows_between":2000,"halvings":0,"cell_chars":16384,"cell_head_chars":4096},"cells_cut":0,"cells_raw":0,"read":"whole","date_system":"1900"}

{"sheet":"Welcome","index":0,"n_rows":1,"n_cols":1,"rows_kept":1,"cut":false,"hidden":false,"merged":[]}
["©2005 Seref, Ahuja, Winston"]

{"sheet":"StockData","index":1,"n_rows":1595,"n_cols":21,"rows_kept":1595,"cut":false,"hidden":true,"merged":[[11,1,11,2]]}
[null,null,null,null,null,null,null,null,null,null,null,null,null,null,null,null,null,null,null,"Jan","01"]
[null,null,null,null,null,null,null,null,null,null,null,null,null,null,null,null,null,null,null,"Feb","02"]
[null,null,null,null,null,null,null,null,null,null,null,null,null,null,null,null,null,null,null,"Mar","03"]
[null,null,null,null,null,null,null,null,null,null,null,null,null,null,null,null,null,null,null,"Apr","04"]
[null,null,null,null,null,null,null,null,null,null,null,null,null,null,null,null,null,null,null,"May","05"]
[null,null,null,null,null,null,null,null,null,null,null,null,null,null,null,null,null,null,null,"Jun","06"]
[null,null,null,null,null,null,null,null,null,null,null,null,null,null,null,null,null,null,null,"Jul","07"]
[null,null,null,null,null,null,null,null,null,null,null,null,null,null,null,null,null,null,null,"Aug","08"]
[null,null,null,null,null,null,null,null,"Buy Allowed?","Sell Allowed?",null,null,"Risk Free Rate",null,null,null,null,null,null,"Sep","09"]
[null,null,null,null,null,null,null,null,"Yes","Yes",null,null,0.05,null,null,null,null,null,null,"Oct","10"]
[null,null,null,null,null,null,null,null,"Cost to Buy (per share)","Cost to Sell (per share)","Starting Number of Shares",null,"Starting Capital",null,null,null,null,null,null,"Nov","11"]
[null,"S&P Data",null,null,null,null,null,null,0.03,0.06,5000,null,100000,null,null,null,null,null,null,"Dec","12"]
[null,"Date","Price      (per share)","Buy Check","Sell Check",null,"Own?",null,"Buy?","Sell?","Number of Shares",null,"Cash Flow",null,"Profit"]
[null,1871.01,4.4400000000000004,null,null,null,null,null,null,null,null,null,null,null,{"$f":"$M$1322","v":102040.09092882754}]
[null,1871.02,4.5]
[null,1871.03,4.6100000000000003]
[null,1871.04,4.74]
[null,1871.05,4.8600000000000003]
[null,1871.06,4.82]
[null,1871.07,4.7300000000000004]
[null,1871.08,4.79]
[null,1871.09,4.84]
[null,1871.1,4.59]
[null,1871.11,4.6399999999999997]
[null,1871.12,4.74]
[null,1872.01,4.8600000000000003]
[null,1872.02,4.88]
[null,1872.03,5.04]
[null,1872.04,5.18]
[null,1872.05,5.18]
[null,1872.06,5.13]
[null,1872.07,5.0999999999999996]
[null,1872.08,5.04]
[null,1872.09,4.95]
[null,1872.1,4.97]
[null,1872.11,4.95]
[null,1872.12,5.07]
[null,1873.01,5.1100000000000003]
[null,1873.02,5.15]
[null,1873.03,5.1100000000000003]
[null,1873.04,5.04]
[null,1873.05,5.05]
[null,1873.06,4.9800000000000004]
[null,1873.07,4.97]
[null,1873.08,4.97]
[null,1873.09,4.59]
[null,1873.1,4.1900000000000004]
[null,1873.11,4.04]
[null,1873.12,4.42]
[null,1874.01,4.66]
[null,1874.02,4.8]
[null,1874.03,4.7300000000000004]
[null,1874.04,4.5999999999999996]
[null,1874.05,4.4800000000000004]
[null,1874.06,4.46]
[null,1874.07,4.46]
[null,1874.08,4.47]
[null,1874.09,4.54]
[null,1874.1,4.53]
[null,1874.11,4.57]
[null,1874.12,4.54]
[null,1875.01,4.54]
[null,1875.02,4.53]
[null,1875.03,4.59]
[null,1875.04,4.6500000000000004]
[null,1875.05,4.47]
[null,1875.06,4.38]
[null,1875.07,4.3899999999999997]
[null,1875.08,4.41]
[null,1875.09,4.37]
[null,1875.1,4.3]
[null,1875.11,4.37]
[null,1875.12,4.37]
[null,1876.01,4.46]
[null,1876.02,4.5199999999999996]
[null,1876.03,4.51]
[null,1876.04,4.34]
[null,1876.05,4.18]
[null,1876.06,4.1500000000000004]
[null,1876.07,4.0999999999999996]
[null,1876.08,3.93]
[null,1876.09,3.69]
[null,1876.1,3.67]
[null,1876.11,3.6]
[null,1876.12,3.58]
[null,1877.01,3.55]
[null,1877.02,3.34]
[null,1877.03,3.17]
[null,1877.04,2.94]
[null,1877.05,2.94]
[null,1877.06,2.73]
[null,1877.07,2.85]
[null,1877.08,3.05]
[null,1877.09,3.24]
[null,1877.1,3.31]
[null,1877.11,3.26]
[null,1877.12,3.25]
[null,1878.01,3.25]
[null,1878.02,3.18]
[null,1878.03,3.24]
[null,1878.04,3.33]
[null,1878.05,3.34]
[null,1878.06,3.41]
[null,1878.07,3.48]
[null,1878.08,3.45]
[null,1878.09,3.52]
[null,1878.1,3.48]
[null,1878.11,3.47]
[null,1878.12,3.45]
[null,1879.01,3.58]
[null,1879.02,3.71]
[null,1879.03,3.65]
[null,1879.04,3.77]
[null,1879.05,3.94]
[null,1879.06,3.96]
[null,1879.07,4.04]
[null,1879.08,4.07]
[null,1879.09,4.22]
[null,1879.1,4.68]
[null,1879.11,4.93]
[null,1879.12,4.92]
[null,1880.01,5.1100000000000003]
[null,1880.02,5.2]
[null,1880.03,5.3]
[null,1880.04,5.18]
[null,1880.05,4.7699999999999996]
[null,1880.06,4.79]
[null,1880.07,5.01]
[null,1880.08,5.19]
[null,1880.09,5.18]
[null,1880.1,5.33]
[null,1880.11,5.61]
[null,1880.12,5.84]
[null,1881.01,6.19]
[null,1881.02,6.17]
[null,1881.03,6.24]
[null,1881.04,6.22]
[null,1881.05,6.5]
[null,1881.06,6.58]
[null,1881.07,6.35]
[null,1881.08,6.2]
[null,1881.09,6.25]
[null,1881.1,6.15]
[null,1881.11,6.19]
[null,1881.12,6.01]
[null,1882.01,5.92]
[null,1882.02,5.79]
[null,1882.03,5.78]
[null,1882.04,5.78]
[null,1882.05,5.71]
[null,1882.06,5.68]
[null,1882.07,6]
[null,1882.08,6.18]
[null,1882.09,6.24]
[null,1882.1,6.07]
[null,1882.11,5.81]
[null,1882.12,5.84]
[null,1883.01,5.81]
[null,1883.02,5.68]
[null,1883.03,5.75]
[null,1883.04,5.87]
[null,1883.05,5.77]
[null,1883.06,5.82]
[null,1883.07,5.73]
[null,1883.08,5.47]
[null,1883.09,5.53]
[null,1883.1,5.38]
[null,1883.11,5.46]
[null,1883.12,5.34]
[null,1884.01,5.18]
[null,1884.02,5.32]
[null,1884.03,5.3]
[null,1884.04,5.0599999999999996]
[null,1884.05,4.6500000000000004]
[null,1884.06,4.46]
[null,1884.07,4.46]
[null,1884.08,4.74]
[null,1884.09,4.59]
[null,1884.1,4.4400000000000004]
[null,1884.11,4.3499999999999996]
[null,1884.12,4.34]
[null,1885.01,4.24]
[null,1885.02,4.37]
[null,1885.03,4.38]
[null,1885.04,4.37]
[null,1885.05,4.32]
[null,1885.06,4.3]
[null,1885.07,4.46]
[null,1885.08,4.71]
[null,1885.09,4.6500000000000004]
[null,1885.1,4.92]
[null,1885.11,5.24]
[null,1885.12,5.2]
[null,1886.01,5.2]
[null,1886.02,5.3]
[null,1886.03,5.19]
[null,1886.04,5.12]
[null,1886.05,5.0199999999999996]
[null,1886.06,5.25]
[null,1886.07,5.33]
[null,1886.08,5.37]
[null,1886.09,5.51]
[null,1886.1,5.65]
[null,1886.11,5.79]
[null,1886.12,5.64]
[null,1887.01,5.58]
[null,1887.02,5.54]
[null,1887.03,5.67]
[null,1887.04,5.8]
[null,1887.05,5.9]
[null,1887.06,5.73]
[null,1887.07,5.59]
[null,1887.08,5.45]
[null,1887.09,5.38]
[null,1887.1,5.2]
[null,1887.11,5.3]
[null,1887.12,5.27]
[null,1888.01,5.31]
[null,1888.02,5.28]
[null,1888.03,5.08]
[null,1888.04,5.0999999999999996]
[null,1888.05,5.17]
[null,1888.06,5.01]
[null,1888.07,5.14]
[null,1888.08,5.25]
[null,1888.09,5.38]
[null,1888.1,5.35]
[null,1888.11,5.24]
[null,1888.12,5.14]
[null,1889.01,5.24]
[null,1889.02,5.3]
[null,1889.03,5.19]
[null,1889.04,5.18]
[null,1889.05,5.32]
[null,1889.06,5.41]
[null,1889.07,5.3]
[null,1889.08,5.37]
[null,1889.09,5.5]
[null,1889.1,5.4]
[null,1889.11,5.35]
[null,1889.12,5.32]
[null,1890.01,5.38]
[null,1890.02,5.32]
[null,1890.03,5.28]
[null,1890.04,5.39]
[null,1890.05,5.62]
[null,1890.06,5.58]
[null,1890.07,5.54]
[null,1890.08,5.41]
[null,1890.09,5.32]
[null,1890.1,5.08]
[null,1890.11,4.71]
[null,1890.12,4.5999999999999996]
[null,1891.01,4.84]
[null,1891.02,4.9000000000000004]
[null,1891.03,4.8099999999999996]
[null,1891.04,4.97]
[null,1891.05,4.95]
[null,1891.06,4.8499999999999996]
[null,1891.07,4.7699999999999996]
[null,1891.08,4.93]
[null,1891.09,5.33]
[null,1891.1,5.33]
[null,1891.11,5.25]
[null,1891.12,5.41]
[null,1892.01,5.51]
[null,1892.02,5.52]
[null,1892.03,5.58]
[null,1892.04,5.57]
[null,1892.05,5.57]
[null,1892.06,5.54]
[null,1892.07,5.54]
[null,1892.08,5.62]
[null,1892.09,5.48]
[null,1892.1,5.59]
[null,1892.11,5.57]
[null,1892.12,5.51]
[null,1893.01,5.61]
[null,1893.02,5.51]
[null,1893.03,5.31]
[null,1893.04,5.31]
[null,1893.05,4.84]
[null,1893.06,4.6100000000000003]
[null,1893.07,4.18]
[null,1893.08,4.08]
[null,1893.09,4.37]
[null,1893.1,4.5]
[null,1893.11,4.57]
[null,1893.12,4.41]
[null,1894.01,4.32]
[null,1894.02,4.38]
[null,1894.03,4.51]
[null,1894.04,4.57]
[null,1894.05,4.4000000000000004]
[null,1894.06,4.34]
[null,1894.07,4.25]
[null,1894.08,4.41]
[null,1894.09,4.4800000000000004]
[null,1894.1,4.34]
[null,1894.11,4.34]
[null,1894.12,4.3]
[null,1895.01,4.25]
[null,1895.02,4.1900000000000004]
[null,1895.03,4.1900000000000004]
[null,1895.04,4.37]
[null,1895.05,4.6100000000000003]
[null,1895.06,4.7]
[null,1895.07,4.72]
[null,1895.08,4.79]
[null,1895.09,4.82]
[null,1895.1,4.75]
[null,1895.11,4.59]
[null,1895.12,4.32]
[null,1896.01,4.2699999999999996]
[null,1896.02,4.45]
[null,1896.03,4.38]
[null,1896.04,4.42]
[null,1896.05,4.4000000000000004]
[null,1896.06,4.32]
[null,1896.07,4.04]
[null,1896.08,3.81]
[null,1896.09,4.01]
[null,1896.1,4.0999999999999996]
[null,1896.11,4.38]
[null,1896.12,4.22]
[null,1897.01,4.22]
[null,1897.02,4.18]
[null,1897.03,4.1900000000000004]
[null,1897.04,4.0599999999999996]
[null,1897.05,4.08]
[null,1897.06,4.2699999999999996]
[null,1897.07,4.46]
[null,1897.08,4.75]
[null,1897.09,4.9800000000000004]
[null,1897.1,4.82]
[null,1897.11,4.6500000000000004]
[null,1897.12,4.75]
[null,1898.01,4.88]
[null,1898.02,4.87]
[null,1898.03,4.6500000000000004]
[null,1898.04,4.57]
[null,1898.05,4.87]
[null,1898.06,5.0599999999999996]
[null,1898.07,5.08]
[null,1898.08,5.27]
[null,1898.09,5.26]
[null,1898.1,5.15]
[null,1898.11,5.32]
[null,1898.12,5.65]
[null,1899.01,6.08]
[null,1899.02,6.31]
[null,1899.03,6.4]
[null,1899.04,6.48]
[null,1899.05,6.21]
[null,1899.06,6.07]
[null,1899.07,6.28]
[null,1899.08,6.44]
[null,1899.09,6.37]
[null,1899.1,6.34]
[null,1899.11,6.46]
[null,1899.12,6.02]
[null,1900.01,6.1]
[null,1900.02,6.21]
[null,1900.03,6.26]
[null,1900.04,6.34]
[null,1900.05,6.04]
[null,1900.06,5.86]
[null,1900.07,5.86]
[null,1900.08,5.94]
[null,1900.09,5.8]
[null,1900.1,6.01]
[null,1900.11,6.48]
[null,1900.12,6.87]
[null,1901.01,7.07]
[null,1901.02,7.25]
[null,1901.03,7.51]
[null,1901.04,8.14]
[null,1901.05,7.73]
[null,1901.06,8.5]
[null,1901.07,7.93]
[null,1901.08,8.0399999999999991]
[null,1901.09,8]
[null,1901.1,7.91]
[null,1901.11,8.08]
[null,1901.12,7.95]
[null,1902.01,8.1199999999999992]
[null,1902.02,8.19]
[null,1902.03,8.1999999999999993]
[null,1902.04,8.48]
[null,1902.05,8.4600000000000009]
[null,1902.06,8.41]
[null,1902.07,8.6]
[null,1902.08,8.83]
[null,1902.09,8.85]
[null,1902.1,8.57]
[null,1902.11,8.24]
[null,1902.12,8.0500000000000007]
[null,1903.01,8.4600000000000009]
[null,1903.02,8.41]
[null,1903.03,8.08]
[null,1903.04,7.75]
[null,1903.05,7.6]
[null,1903.06,7.18]
[null,1903.07,6.85]
[null,1903.08,6.63]
[null,1903.09,6.47]
[null,1903.1,6.26]
[null,1903.11,6.28]
[null,1903.12,6.57]
[null,1904.01,6.68]
[null,1904.02,6.5]
[null,1904.03,6.48]
[null,1904.04,6.64]
[null,1904.05,6.5]
[null,1904.06,6.51]
[null,1904.07,6.78]
[null,1904.08,7.01]
[null,1904.09,7.32]
[null,1904.1,7.75]
[null,1904.11,8.17]
[null,1904.12,8.25]
[null,1905.01,8.43]
[null,1905.02,8.8000000000000007]
[null,1905.03,9.0500000000000007]
[null,1905.04,8.94]
[null,1905.05,8.5]
[null,1905.06,8.6]
[null,1905.07,8.8699999999999992]
[null,1905.08,9.1999999999999993]
[null,1905.09,9.23]
[null,1905.1,9.36]
[null,1905.11,9.31]
[null,1905.12,9.5399999999999991]
[null,1906.01,9.8699999999999992]
[null,1906.02,9.8000000000000007]
[null,1906.03,9.56]
[null,1906.04,9.43]
[null,1906.05,9.18]
[null,1906.06,9.3000000000000007]
[null,1906.07,9.06]
[null,1906.08,9.73]
[null,1906.09,10.029999999999999]
[null,1906.1,9.73]
[null,1906.11,9.93]
[null,1906.12,9.84]
[null,1907.01,9.56]
[null,1907.02,9.26]
[null,1907.03,8.35]
[null,1907.04,8.39]
[null,1907.05,8.1]
[null,1907.06,7.84]
[null,1907.07,8.14]
[null,1907.08,7.53]
[null,1907.09,7.45]
[null,1907.1,6.64]
[null,1907.11,6.25]
[null,1907.12,6.57]
[null,1908.01,6.85]
[null,1908.02,6.6]
[null,1908.03,6.87]
[null,1908.04,7.24]
[null,1908.05,7.63]
[null,1908.06,7.64]
[null,1908.07,7.92]
[null,1908.08,8.26]
[null,1908.09,8.17]
[null,1908.1,8.27]
[null,1908.11,8.83]
[null,1908.12,9.0299999999999994]
[null,1909.01,9.06]
[null,1909.02,8.8000000000000007]
[null,1909.03,8.92]
[null,1909.04,9.32]
[null,1909.05,9.6300000000000008]
[null,1909.06,9.8000000000000007]
[null,1909.07,9.94]
[null,1909.08,10.18]
[null,1909.09,10.19]
[null,1909.1,10.23]
[null,1909.11,10.18]
[null,1909.12,10.3]
[null,1910.01,10.08]
[null,1910.02,9.7200000000000006]
[null,1910.03,9.9600000000000009]
[null,1910.04,9.7200000000000006]
[null,1910.05,9.56]
[null,1910.06,9.1]
[null,1910.07,8.64]
[null,1910.08,8.85]
[null,1910.09,8.91]
[null,1910.1,9.32]
[null,1910.11,9.31]
[null,1910.12,9.0500000000000007]
[null,1911.01,9.27]
[null,1911.02,9.43]
[null,1911.03,9.32]
[null,1911.04,9.2799999999999994]
[null,1911.05,9.48]
[null,1911.06,9.67]
[null,1911.07,9.6300000000000008]
[null,1911.08,9.17]
[null,1911.09,8.67]
[null,1911.1,8.7200000000000006]
[null,1911.11,9.07]
[null,1911.12,9.11]
[null,1912.01,9.1199999999999992]
[null,1912.02,9.0399999999999991]
[null,1912.03,9.3000000000000007]
[null,1912.04,9.59]
[null,1912.05,9.58]
[null,1912.06,9.58]
[null,1912.07,9.59]
[null,1912.08,9.81]
[null,1912.09,9.86]
[null,1912.1,9.84]
[null,1912.11,9.73]
[null,1912.12,9.3800000000000008]
[null,1913.01,9.3000000000000007]
[null,1913.02,8.9700000000000006]
[null,1913.03,8.8000000000000007]
[null,1913.04,8.7899999999999991]
[null,1913.05,8.5500000000000007]
[null,1913.06,8.1199999999999992]
[null,1913.07,8.23]
[null,1913.08,8.4499999999999993]
[null,1913.09,8.5299999999999994]
[null,1913.1,8.26]
[null,1913.11,8.0500000000000007]
[null,1913.12,8.0399999999999991]
[null,1914.01,8.3699999999999992]
[null,1914.02,8.48]
[null,1914.03,8.32]
[null,1914.04,8.1199999999999992]
[null,1914.05,8.17]
[null,1914.06,8.1300000000000008]
[null,1914.07,7.68]
[null,1914.08,7.68]
[null,1914.09,7.68]
[null,1914.1,7.68]
[null,1914.11,7.68]
[null,1914.12,7.35]
[null,1915.01,7.48]
[null,1915.02,7.38]
[null,1915.03,7.57]
[null,1915.04,8.14]
[null,1915.05,7.95]
[null,1915.06,8.0399999999999991]
[null,1915.07,8.01]
[null,1915.08,8.35]
[null,1915.09,8.66]
[null,1915.1,9.14]
[null,1915.11,9.4600000000000009]
[null,1915.12,9.48]
[null,1916.01,9.33]
[null,1916.02,9.1999999999999993]
[null,1916.03,9.17]
[null,1916.04,9.07]
[null,1916.05,9.27]
[null,1916.06,9.36]
[null,1916.07,9.23]
[null,1916.08,9.3000000000000007]
[null,1916.09,9.68]
[null,1916.1,9.98]
[null,1916.11,10.210000000000001]
[null,1916.12,9.8000000000000007]
[null,1917.01,9.57]
[null,1917.02,9.0299999999999994]
[null,1917.03,9.31]
[null,1917.04,9.17]
[null,1917.05,8.86]
[null,1917.06,9.0399999999999991]
[null,1917.07,8.7899999999999991]
[null,1917.08,8.5299999999999994]
[null,1917.09,8.1199999999999992]
[null,1917.1,7.68]
[null,1917.11,7.04]
[null,1917.12,6.8]
[null,1918.01,7.21]
[null,1918.02,7.43]
[null,1918.03,7.28]
[null,1918.04,7.21]
[null,1918.05,7.44]
[null,1918.06,7.45]
[null,1918.07,7.51]
[null,1918.08,7.58]
[null,1918.09,7.54]
[null,1918.1,7.86]
[null,1918.11,8.06]
[null,1918.12,7.9]
[null,1919.01,7.85]
[null,1919.02,7.88]
[null,1919.03,8.1199999999999992]
[null,1919.04,8.39]
[null,1919.05,8.9700000000000006]
[null,1919.06,9.2100000000000009]
[null,1919.07,9.51]
[null,1919.08,8.8699999999999992]
[null,1919.09,9.01]
[null,1919.1,9.4700000000000006]
[null,1919.11,9.19]
[null,1919.12,8.92]
[null,1920.01,8.83,{"$f":"AVERAGE(C596:C601)","v":9.1616666666666671},{"$f":"AVERAGE(C594:C601)","v":9.1437499999999989},null,"Yes",null,{"$f":"IF(BuyAllowed=\"Yes\",IF(AND(G602 = \"No\", C602>D602), \"Yes\", \"No\"),\"No\")","v":"No"},{"$f":"IF(SellAllowed=\"Yes\",IF(AND(G602 = \"Yes\", C602<E602), \"Yes\", \"No\"),\"No\")","v":"Yes"},{"$f":"IF(I602=\"Yes\", StartCap/(C602+CostBuy), IF(J602 = \"Yes\", 0, StartShares))","v":0},null,{"$f":"IF(I602 = \"Yes\", StartCap-(C602+CostBuy)*K602, IF(J602=\"Yes\", StartCap+(C602-CostSell)*StartShares, StartCap+StartShares*Rate))","v":143850}]
[null,1920.02,8.1,{"$f":"AVERAGE(C597:C602)","v":9.0483333333333338},{"$f":"AVERAGE(C595:C602)","v":9.1262499999999989},null,{"$f":"IF(I602 = \"Yes\", \"Yes\", IF(J602=\"Yes\", \"No\", G602))","v":"No"},null,{"$f":"IF(BuyAllowed=\"Yes\",IF(AND(G603 = \"No\", C603>D603), \"Yes\", \"No\"),\"No\")","v":"No"},{"$f":"IF(SellAllowed=\"Yes\",IF(AND(G603 = \"Yes\", C603<E603), \"Yes\", \"No\"),\"No\")","v":"No"},{"$f":"IF(I603 = \"Yes\", M602/(C603+CostBuy), IF(J603 = \"Yes\", 0, K602))","v":0},null,{"$f":"IF(I603 = \"Yes\", M602-(C603+CostBuy)*K603, IF(J603=\"Yes\", M602+(C603-CostSell)*K602, M602+K603*Rate))","v":143850}]
[null,1920.03,8.67,8.92,8.9874999999999989,null,{"$f":"IF(I603 = \"Yes\", \"Yes\", IF(J603=\"Yes\", \"No\", G603))","v":"No"},null,{"$f":"IF(BuyAllowed=\"Yes\",IF(AND(G604 = \"No\", C604>D604), \"Yes\", \"No\"),\"No\")","v":"No"},{"$f":"IF(SellAllowed=\"Yes\",IF(AND(G604 = \"Yes\", C604<E604), \"Yes\", \"No\"),\"No\")","v":"No"},{"$f":"IF(I604 = \"Yes\", M603/(C604+CostBuy), IF(J604 = \"Yes\", 0, K603))","v":0},null,{"$f":"IF(I604 = \"Yes\", M603-(C604+CostBuy)*K604, IF(J604=\"Yes\", M603+(C604-CostSell)*K603, M603+K604*Rate))","v":143850}]
[null,1920.04,8.6,8.8633333333333333,8.8825000000000003,null,"No",null,{"$f":"IF(BuyAllowed=\"Yes\",IF(AND(G605 = \"No\", C605>D605), \"Yes\", \"No\"),\"No\")","v":"No"},{"$f":"IF(SellAllowed=\"Yes\",IF(AND(G605 = \"Yes\", C605<E605), \"Yes\", \"No\"),\"No\")","v":"No"},{"$f":"IF(I605 = \"Yes\", M604/(C605+CostBuy), IF(J605 = \"Yes\", 0, K604))","v":0},null,{"$f":"IF(I605 = \"Yes\", M604-(C605+CostBuy)*K605, IF(J605=\"Yes\", M604+(C605-CostSell)*K604, M604+K605*Rate))","v":143850}]
[null,1920.05,8.06,8.7183333333333337,8.8487500000000008,null,"No",null,{"$f":"IF(BuyAllowed=\"Yes\",IF(AND(G606 = \"No\", C606>D606), \"Yes\", \"No\"),\"No\")","v":"No"},{"$f":"IF(SellAllowed=\"Yes\",IF(AND(G606 = \"Yes\", C606<E606), \"Yes\", \"No\"),\"No\")","v":"No"},{"$f":"IF(I606 = \"Yes\", M605/(C606+CostBuy), IF(J606 = \"Yes\", 0, K605))","v":0},null,{"$f":"IF(I606 = \"Yes\", M605-(C606+CostBuy)*K606, IF(J606=\"Yes\", M605+(C606-CostSell)*K605, M605+K606*Rate))","v":143850}]
[null,1920.06,7.92,8.5300000000000011,8.73,null,"No",null,{"$f":"IF(BuyAllowed=\"Yes\",IF(AND(G607 = \"No\", C607>D607), \"Yes\", \"No\"),\"No\")","v":"No"},{"$f":"IF(SellAllowed=\"Yes\",IF(AND(G607 = \"Yes\", C607<E607), \"Yes\", \"No\"),\"No\")","v":"No"},{"$f":"IF(I607 = \"Yes\", M606/(C607+CostBuy), IF(J607 = \"Yes\", 0, K606))","v":0},null,{"$f":"IF(I607 = \"Yes\", M606-(C607+CostBuy)*K607, IF(J607=\"Yes\", M606+(C607-CostSell)*K606, M606+K607*Rate))","v":143850}]
[null,1920.07,7.91,8.3633333333333351,8.5362500000000008,null,"No",null,{"$f":"IF(BuyAllowed=\"Yes\",IF(AND(G608 = \"No\", C608>D608), \"Yes\", \"No\"),\"No\")","v":"No"},{"$f":"IF(SellAllowed=\"Yes\",IF(AND(G608 = \"Yes\", C608<E608), \"Yes\", \"No\"),\"No\")","v":"No"},{"$f":"IF(I608 = \"Yes\", M607/(C608+CostBuy), IF(J608 = \"Yes\", 0, K607))","v":0},null,{"$f":"IF(I608 = \"Yes\", M607-(C608+CostBuy)*K608, IF(J608=\"Yes\", M607+(C608-CostSell)*K607, M607+K608*Rate))","v":143850}]
[null,1920.08,7.6,8.2100000000000009,8.3762500000000006,null,"No",null,{"$f":"IF(BuyAllowed=\"Yes\",IF(AND(G609 = \"No\", C609>D609), \"Yes\", \"No\"),\"No\")","v":"No"},{"$f":"IF(SellAllowed=\"Yes\",IF(AND(G609 = \"Yes\", C609<E609), \"Yes\", \"No\"),\"No\")","v":"No"},{"$f":"IF(I609 = \"Yes\", M608/(C609+CostBuy), IF(J609 = \"Yes\", 0, K608))","v":0},null,{"$f":"IF(I609 = \"Yes\", M608-(C609+CostBuy)*K609, IF(J609=\"Yes\", M608+(C609-CostSell)*K608, M608+K609*Rate))","v":143850}]
[null,1920.09,7.87,8.1266666666666669,8.2112499999999997,null,"No",null,{"$f":"IF(BuyAllowed=\"Yes\",IF(AND(G610 = \"No\", C610>D610), \"Yes\", \"No\"),\"No\")","v":"No"},{"$f":"IF(SellAllowed=\"Yes\",IF(AND(G610 = \"Yes\", C610<E610), \"Yes\", \"No\"),\"No\")","v":"No"},{"$f":"IF(I610 = \"Yes\", M609/(C610+CostBuy), IF(J610 = \"Yes\", 0, K609))","v":0},null,{"$f":"IF(I610 = \"Yes\", M609-(C610+CostBuy)*K610, IF(J610=\"Yes\", M609+(C610-CostSell)*K609, M609+K610*Rate))","v":143850}]
[null,1920.1,7.88,7.9933333333333323,8.0912500000000005,null,"No",null,{"$f":"IF(BuyAllowed=\"Yes\",IF(AND(G611 = \"No\", C611>D611), \"Yes\", \"No\"),\"No\")","v":"No"},{"$f":"IF(SellAllowed=\"Yes\",IF(AND(G611 = \"Yes\", C611<E611), \"Yes\", \"No\"),\"No\")","v":"No"},{"$f":"IF(I611 = \"Yes\", M610/(C611+CostBuy), IF(J611 = \"Yes\", 0, K610))","v":0},null,{"$f":"IF(I611 = \"Yes\", M610-(C611+CostBuy)*K611, IF(J611=\"Yes\", M610+(C611-CostSell)*K610, M610+K611*Rate))","v":143850}]
[null,1920.11,7.48,7.873333333333334,8.0637499999999989,null,"No",null,{"$f":"IF(BuyAllowed=\"Yes\",IF(AND(G612 = \"No\", C612>D612), \"Yes\", \"No\"),\"No\")","v":"No"},{"$f":"IF(SellAllowed=\"Yes\",IF(AND(G612 = \"Yes\", C612<E612), \"Yes\", \"No\"),\"No\")","v":"No"},{"$f":"IF(I612 = \"Yes\", M611/(C612+CostBuy), IF(J612 = \"Yes\", 0, K611))","v":0},null,{"$f":"IF(I612 = \"Yes\", M611-(C612+CostBuy)*K612, IF(J612=\"Yes\", M611+(C612-CostSell)*K611, M611+K612*Rate))","v":143850}]
[null,1920.12,6.81,7.7766666666666664,7.9149999999999991,null,"No",null,{"$f":"IF(BuyAllowed=\"Yes\",IF(AND(G613 = \"No\", C613>D613), \"Yes\", \"No\"),\"No\")","v":"No"},{"$f":"IF(SellAllowed=\"Yes\",IF(AND(G613 = \"Yes\", C613<E613), \"Yes\", \"No\"),\"No\")","v":"No"},{"$f":"IF(I613 = \"Yes\", M612/(C613+CostBuy), IF(J613 = \"Yes\", 0, K612))","v":0},null,{"$f":"IF(I613 = \"Yes\", M612-(C613+CostBuy)*K613, IF(J613=\"Yes\", M612+(C613-CostSell)*K612, M612+K613*Rate))","v":143850}]
[null,1921.01,7.11,7.5916666666666659,7.6912500000000001,null,"No",null,{"$f":"IF(BuyAllowed=\"Yes\",IF(AND(G614 = \"No\", C614>D614), \"Yes\", \"No\"),\"No\")","v":"No"},{"$f":"IF(SellAllowed=\"Yes\",IF(AND(G614 = \"Yes\", C614<E614), \"Yes\", \"No\"),\"No\")","v":"No"},{"$f":"IF(I614 = \"Yes\", M613/(C614+CostBuy), IF(J614 = \"Yes\", 0, K613))","v":0},null,{"$f":"IF(I614 = \"Yes\", M613-(C614+CostBuy)*K614, IF(J614=\"Yes\", M613+(C614-CostSell)*K613, M613+K614*Rate))","v":143850}]
[null,1921.02,7.06,7.458333333333333,7.5724999999999998,null,"No",null,{"$f":"IF(BuyAllowed=\"Yes\",IF(AND(G615 = \"No\", C615>D615), \"Yes\", \"No\"),\"No\")","v":"No"},{"$f":"IF(SellAllowed=\"Yes\",IF(AND(G615 = \"Yes\", C615<E615), \"Yes\", \"No\"),\"No\")","v":"No"},{"$f":"IF(I615 = \"Yes\", M614/(C615+CostBuy), IF(J615 = \"Yes\", 0, K614))","v":0},null,{"$f":"IF(I615 = \"Yes\", M614-(C615+CostBuy)*K615, IF(J615=\"Yes\", M614+(C615-CostSell)*K614, M614+K615*Rate))","v":143850}]
[null,1921.03,6.88,7.3683333333333332,7.4649999999999999,null,"No",null,{"$f":"IF(BuyAllowed=\"Yes\",IF(AND(G616 = \"No\", C616>D616), \"Yes\", \"No\"),\"No\")","v":"No"},{"$f":"IF(SellAllowed=\"Yes\",IF(AND(G616 = \"Yes\", C616<E616), \"Yes\", \"No\"),\"No\")","v":"No"},{"$f":"IF(I616 = \"Yes\", M615/(C616+CostBuy), IF(J616 = \"Yes\", 0, K615))","v":0},null,{"$f":"IF(I616 = \"Yes\", M615-(C616+CostBuy)*K616, IF(J616=\"Yes\", M615+(C616-CostSell)*K615, M615+K616*Rate))","v":143850}]
[null,1921.04,6.91,7.2033333333333331,7.3362500000000006,null,"No",null,{"$f":"IF(BuyAllowed=\"Yes\",IF(AND(G617 = \"No\", C617>D617), \"Yes\", \"No\"),\"No\")","v":"No"},{"$f":"IF(SellAllowed=\"Yes\",IF(AND(G617 = \"Yes\", C617<E617), \"Yes\", \"No\"),\"No\")","v":"No"},{"$f":"IF(I617 = \"Yes\", M616/(C617+CostBuy), IF(J617 = \"Yes\", 0, K616))","v":0},null,{"$f":"IF(I617 = \"Yes\", M616-(C617+CostBuy)*K617, IF(J617=\"Yes\", M616+(C617-CostSell)*K616, M616+K617*Rate))","v":143850}]
[null,1921.05,7.12,7.041666666666667,7.25,null,"No",null,{"$f":"IF(BuyAllowed=\"Yes\",IF(AND(G618 = \"No\", C618>D618), \"Yes\", \"No\"),\"No\")","v":"Yes"},{"$f":"IF(SellAllowed=\"Yes\",IF(AND(G618 = \"Yes\", C618<E618), \"Yes\", \"No\"),\"No\")","v":"No"},{"$f":"IF(I618 = \"Yes\", M617/(C618+CostBuy), IF(J618 = \"Yes\", 0, K617))","v":20118.88111888112},null,{"$f":"IF(I618 = \"Yes\", M617-(C618+CostBuy)*K618, IF(J618=\"Yes\", M617+(C618-CostSell)*K617, M617+K618*Rate))","v":0}]
[null,1921.06,6.55,6.9816666666666656,7.1562499999999991,null,"Yes",null,{"$f":"IF(BuyAllowed=\"Yes\",IF(AND(G619 = \"No\", C619>D619), \"Yes\", \"No\"),\"No\")","v":"No"},{"$f":"IF(SellAllowed=\"Yes\",IF(AND(G619 = \"Yes\", C619<E619), \"Yes\", \"No\"),\"No\")","v":"Yes"},{"$f":"IF(I619 = \"Yes\", M618/(C619+CostBuy), IF(J619 = \"Yes\", 0, K618))","v":0},null,{"$f":"IF(I619 = \"Yes\", M618-(C619+CostBuy)*K619, IF(J619=\"Yes\", M618+(C619-CostSell)*K618, M618+K619*Rate))","v":130571.53846153847}]
[null,1921.07,6.53,6.9383333333333326,6.9899999999999993,null,"No",null,{"$f":"IF(BuyAllowed=\"Yes\",IF(AND(G620 = \"No\", C620>D620), \"Yes\", \"No\"),\"No\")","v":"No"},{"$f":"IF(SellAllowed=\"Yes\",IF(AND(G620 = \"Yes\", C620<E620), \"Yes\", \"No\"),\"No\")","v":"No"},{"$f":"IF(I620 = \"Yes\", M619/(C620+CostBuy), IF(J620 = \"Yes\", 0, K619))","v":0},null,{"$f":"IF(I620 = \"Yes\", M619-(C620+CostBuy)*K620, IF(J620=\"Yes\", M619+(C620-CostSell)*K619, M619+K620*Rate))","v":130571.53846153847}]
[null,1921.08,6.45,6.8416666666666677,6.871249999999999,null,"No",null,{"$f":"IF(BuyAllowed=\"Yes\",IF(AND(G621 = \"No\", C621>D621), \"Yes\", \"No\"),\"No\")","v":"No"},{"$f":"IF(SellAllowed=\"Yes\",IF(AND(G621 = \"Yes\", C621<E621), \"Yes\", \"No\"),\"No\")","v":"No"},{"$f":"IF(I621 = \"Yes\", M620/(C621+CostBuy), IF(J621 = \"Yes\", 0, K620))","v":0},null,{"$f":"IF(I621 = \"Yes\", M620-(C621+CostBuy)*K621, IF(J621=\"Yes\", M620+(C621-CostSell)*K620, M620+K621*Rate))","v":130571.53846153847}]
[null,1921.09,6.61,6.7400000000000011,6.8262499999999999,null,"No",null,{"$f":"IF(BuyAllowed=\"Yes\",IF(AND(G622 = \"No\", C622>D622), \"Yes\", \"No\"),\"No\")","v":"No"},{"$f":"IF(SellAllowed=\"Yes\",IF(AND(G622 = \"Yes\", C622<E622), \"Yes\", \"No\"),\"No\")","v":"No"},{"$f":"IF(I622 = \"Yes\", M621/(C622+CostBuy), IF(J622 = \"Yes\", 0, K621))","v":0},null,{"$f":"IF(I622 = \"Yes\", M621-(C622+CostBuy)*K622, IF(J622=\"Yes\", M621+(C622-CostSell)*K621, M621+K622*Rate))","v":130571.53846153847}]
[null,1921.1,6.7,6.6950000000000003,6.7637500000000008,null,"No",null,{"$f":"IF(BuyAllowed=\"Yes\",IF(AND(G623 = \"No\", C623>D623), \"Yes\", \"No\"),\"No\")","v":"Yes"},{"$f":"IF(SellAllowed=\"Yes\",IF(AND(G623 = \"Yes\", C623<E623), \"Yes\", \"No\"),\"No\")","v":"No"},{"$f":"IF(I623 = \"Yes\", M622/(C623+CostBuy), IF(J623 = \"Yes\", 0, K622))","v":19401.417304834838},null,{"$f":"IF(I623 = \"Yes\", M622-(C623+CostBuy)*K623, IF(J623=\"Yes\", M622+(C623-CostSell)*K622, M622+K623*Rate))","v":0}]
[null,1921.11,7.06,6.66,6.7187500000000009,null,"Yes",null,{"$f":"IF(BuyAllowed=\"Yes\",IF(AND(G624 = \"No\", C624>D624), \"Yes\", \"No\"),\"No\")","v":"No"},{"$f":"IF(SellAllowed=\"Yes\",IF(AND(G624 = \"Yes\", C624<E624), \"Yes\", \"No\"),\"No\")","v":"No"},{"$f":"IF(I624 = \"Yes\", M623/(C624+CostBuy), IF(J624 = \"Yes\", 0, K623))","v":19401.417304834838},null,{"$f":"IF(I624 = \"Yes\", M623-(C624+CostBuy)*K624, IF(J624=\"Yes\", M623+(C624-CostSell)*K623, M623+K624*Rate))","v":970.07086524174201}]
[null,1921.12,7.31,6.6500000000000012,6.7412500000000009,null,"Yes",null,{"$f":"IF(BuyAllowed=\"Yes\",IF(AND(G625 = \"No\", C625>D625), \"Yes\", \"No\"),\"No\")","v":"No"},{"$f":"IF(SellAllowed=\"Yes\",IF(AND(G625 = \"Yes\", C625<E625), \"Yes\", \"No\"),\"No\")","v":"No"},{"$f":"IF(I625 = \"Yes\", M624/(C625+CostBuy), IF(J625 = \"Yes\", 0, K624))","v":19401.417304834838},null,{"$f":"IF(I625 = \"Yes\", M624-(C625+CostBuy)*K625, IF(J625=\"Yes\", M624+(C625-CostSell)*K624, M624+K625*Rate))","v":1940.141730483484}]
[null,1922.01,7.3,6.7766666666666673,6.7912500000000007,null,"Yes",null,{"$f":"IF(BuyAllowed=\"Yes\",IF(AND(G626 = \"No\", C626>D626), \"Yes\", \"No\"),\"No\")","v":"No"},{"$f":"IF(SellAllowed=\"Yes\",IF(AND(G626 = \"Yes\", C626<E626), \"Yes\", \"No\"),\"No\")","v":"No"},{"$f":"IF(I626 = \"Yes\", M625/(C626+CostBuy), IF(J626 = \"Yes\", 0, K625))","v":19401.417304834838},null,{"$f":"IF(I626 = \"Yes\", M625-(C626+CostBuy)*K626, IF(J626=\"Yes\", M625+(C626-CostSell)*K625, M625+K626*Rate))","v":2910.212595725226}]
[null,1922.02,7.46,6.9050000000000002,6.8137500000000006,null,"Yes",null,{"$f":"IF(BuyAllowed=\"Yes\",IF(AND(G627 = \"No\", C627>D627), \"Yes\", \"No\"),\"No\")","v":"No"},{"$f":"IF(SellAllowed=\"Yes\",IF(AND(G627 = \"Yes\", C627<E627), \"Yes\", \"No\"),\"No\")","v":"No"},{"$f":"IF(I627 = \"Yes\", M626/(C627+CostBuy), IF(J627 = \"Yes\", 0, K626))","v":19401.417304834838},null,{"$f":"IF(I627 = \"Yes\", M626-(C627+CostBuy)*K627, IF(J627=\"Yes\", M626+(C627-CostSell)*K626, M626+K627*Rate))","v":3880.2834609669681}]
[null,1922.03,7.74,7.0733333333333333,6.9275000000000002,null,"Yes",null,{"$f":"IF(BuyAllowed=\"Yes\",IF(AND(G628 = \"No\", C628>D628), \"Yes\", \"No\"),\"No\")","v":"No"},{"$f":"IF(SellAllowed=\"Yes\",IF(AND(G628 = \"Yes\", C628<E628), \"Yes\", \"No\"),\"No\")","v":"No"},{"$f":"IF(I628 = \"Yes\", M627/(C628+CostBuy), IF(J628 = \"Yes\", 0, K627))","v":19401.417304834838},null,{"$f":"IF(I628 = \"Yes\", M627-(C628+CostBuy)*K628, IF(J628=\"Yes\", M627+(C628-CostSell)*K627, M627+K628*Rate))","v":4850.3543262087096}]
[null,1922.04,8.2100000000000009,7.2616666666666667,7.0787500000000003,null,"Yes",null,{"$f":"IF(BuyAllowed=\"Yes\",IF(AND(G629 = \"No\", C629>D629), \"Yes\", \"No\"),\"No\")","v":"No"},{"$f":"IF(SellAllowed=\"Yes\",IF(AND(G629 = \"Yes\", C629<E629), \"Yes\", \"No\"),\"No\")","v":"No"},{"$f":"IF(I629 = \"Yes\", M628/(C629+CostBuy), IF(J629 = \"Yes\", 0, K628))","v":19401.417304834838},null,{"$f":"IF(I629 = \"Yes\", M628-(C629+CostBuy)*K629, IF(J629=\"Yes\", M628+(C629-CostSell)*K628, M628+K629*Rate))","v":5820.4251914504512}]
[null,1922.05,8.5299999999999994,7.5133333333333328,7.2987500000000001,null,"Yes",null,{"$f":"IF(BuyAllowed=\"Yes\",IF(AND(G630 = \"No\", C630>D630), \"Yes\", \"No\"),\"No\")","v":"No"},{"$f":"IF(SellAllowed=\"Yes\",IF(AND(G630 = \"Yes\", C630<E630), \"Yes\", \"No\"),\"No\")","v":"No"},{"$f":"IF(I630 = \"Yes\", M629/(C630+CostBuy), IF(J630 = \"Yes\", 0, K629))","v":19401.417304834838},null,{"$f":"IF(I630 = \"Yes\", M629-(C630+CostBuy)*K630, IF(J630=\"Yes\", M629+(C630-CostSell)*K629, M629+K630*Rate))","v":6790.4960566921927}]
[null,1922.06,8.4499999999999993,7.7583333333333337,7.5387500000000003,null,"Yes",null,{"$f":"IF(BuyAllowed=\"Yes\",IF(AND(G631 = \"No\", C631>D631), \"Yes\", \"No\"),\"No\")","v":"No"},{"$f":"IF(SellAllowed=\"Yes\",IF(AND(G631 = \"Yes\", C631<E631), \"Yes\", \"No\"),\"No\")","v":"No"},{"$f":"IF(I631 = \"Yes\", M630/(C631+CostBuy), IF(J631 = \"Yes\", 0, K630))","v":19401.417304834838},null,{"$f":"IF(I631 = \"Yes\", M630-(C631+CostBuy)*K631, IF(J631=\"Yes\", M630+(C631-CostSell)*K630, M630+K631*Rate))","v":7760.5669219339343}]
[null,1922.07,8.51,7.9483333333333333,7.7575000000000003,null,"Yes",null,{"$f":"IF(BuyAllowed=\"Yes\",IF(AND(G632 = \"No\", C632>D632), \"Yes\", \"No\"),\"No\")","v":"No"},{"$f":"IF(SellAllowed=\"Yes\",IF(AND(G632 = \"Yes\", C632<E632), \"Yes\", \"No\"),\"No\")","v":"No"},{"$f":"IF(I632 = \"Yes\", M631/(C632+CostBuy), IF(J632 = \"Yes\", 0, K631))","v":19401.417304834838},null,{"$f":"IF(I632 = \"Yes\", M631-(C632+CostBuy)*K632, IF(J632=\"Yes\", M631+(C632-CostSell)*K631, M631+K632*Rate))","v":8730.6377871756758}]
[null,1922.08,8.83,8.15,7.9387499999999998,null,"Yes",null,{"$f":"IF(BuyAllowed=\"Yes\",IF(AND(G633 = \"No\", C633>D633), \"Yes\", \"No\"),\"No\")","v":"No"},{"$f":"IF(SellAllowed=\"Yes\",IF(AND(G633 = \"Yes\", C633<E633), \"Yes\", \"No\"),\"No\")","v":"No"},{"$f":"IF(I633 = \"Yes\", M632/(C633+CostBuy), IF(J633 = \"Yes\", 0, K632))","v":19401.417304834838},null,{"$f":"IF(I633 = \"Yes\", M632-(C633+CostBuy)*K633, IF(J633=\"Yes\", M632+(C633-CostSell)*K632, M632+K633*Rate))","v":9700.7086524174174}]
[null,1922.09,9.06,8.3783333333333321,8.1287500000000001,null,"Yes",null,{"$f":"IF(BuyAllowed=\"Yes\",IF(AND(G634 = \"No\", C634>D634), \"Yes\", \"No\"),\"No\")","v":"No"},{"$f":"IF(SellAllowed=\"Yes\",IF(AND(G634 = \"Yes\", C634<E634), \"Yes\", \"No\"),\"No\")","v":"No"},{"$f":"IF(I634 = \"Yes\", M633/(C634+CostBuy), IF(J634 = \"Yes\", 0, K633))","v":19401.417304834838},null,{"$f":"IF(I634 = \"Yes\", M633-(C634+CostBuy)*K634, IF(J634=\"Yes\", M633+(C634-CostSell)*K633, M633+K634*Rate))","v":10670.779517659159}]
[null,1922.1,9.26,8.5983333333333345,8.348749999999999,null,"Yes",null,{"$f":"IF(BuyAllowed=\"Yes\",IF(AND(G635 = \"No\", C635>D635), \"Yes\", \"No\"),\"No\")","v":"No"},{"$f":"IF(SellAllowed=\"Yes\",IF(AND(G635 = \"Yes\", C635<E635), \"Yes\", \"No\"),\"No\")","v":"No"},{"$f":"IF(I635 = \"Yes\", M634/(C635+CostBuy), IF(J635 = \"Yes\", 0, K634))","v":19401.417304834838},null,{"$f":"IF(I635 = \"Yes\", M634-(C635+CostBuy)*K635, IF(J635=\"Yes\", M634+(C635-CostSell)*K634, M634+K635*Rate))","v":11640.850382900901}]
[null,1922.11,8.8000000000000007,8.7733333333333317,8.5737500000000004,null,"Yes",null,{"$f":"IF(BuyAllowed=\"Yes\",IF(AND(G636 = \"No\", C636>D636), \"Yes\", \"No\"),\"No\")","v":"No"},{"$f":"IF(SellAllowed=\"Yes\",IF(AND(G636 = \"Yes\", C636<E636), \"Yes\", \"No\"),\"No\")","v":"No"},{"$f":"IF(I636 = \"Yes\", M635/(C636+CostBuy), IF(J636 = \"Yes\", 0, K635))","v":19401.417304834838},null,{"$f":"IF(I636 = \"Yes\", M635-(C636+CostBuy)*K636, IF(J636=\"Yes\", M635+(C636-CostSell)*K635, M635+K636*Rate))","v":12610.921248142642}]
[null,1922.12,8.7799999999999994,8.8183333333333334,8.7062500000000007,null,"Yes",null,{"$f":"IF(BuyAllowed=\"Yes\",IF(AND(G637 = \"No\", C637>D637), \"Yes\", \"No\"),\"No\")","v":"No"},{"$f":"IF(SellAllowed=\"Yes\",IF(AND(G637 = \"Yes\", C637<E637), \"Yes\", \"No\"),\"No\")","v":"No"},{"$f":"IF(I637 = \"Yes\", M636/(C637+CostBuy), IF(J637 = \"Yes\", 0, K636))","v":19401.417304834838},null,{"$f":"IF(I637 = \"Yes\", M636-(C637+CostBuy)*K637, IF(J637=\"Yes\", M636+(C637-CostSell)*K636, M636+K637*Rate))","v":13580.992113384384}]
[null,1923.01,8.9,8.8733333333333331,8.7774999999999999,null,"Yes",null,{"$f":"IF(BuyAllowed=\"Yes\",IF(AND(G638 = \"No\", C638>D638), \"Yes\", \"No\"),\"No\")","v":"No"},{"$f":"IF(SellAllowed=\"Yes\",IF(AND(G638 = \"Yes\", C638<E638), \"Yes\", \"No\"),\"No\")","v":"No"},{"$f":"IF(I638 = \"Yes\", M637/(C638+CostBuy), IF(J638 = \"Yes\", 0, K637))","v":19401.417304834838},null,{"$f":"IF(I638 = \"Yes\", M637-(C638+CostBuy)*K638, IF(J638=\"Yes\", M637+(C638-CostSell)*K637, M637+K638*Rate))","v":14551.062978626125}]
[null,1923.02,9.2799999999999994,8.9383333333333344,8.8237500000000004,null,"Yes",null,{"$f":"IF(BuyAllowed=\"Yes\",IF(AND(G639 = \"No\", C639>D639), \"Yes\", \"No\"),\"No\")","v":"No"},{"$f":"IF(SellAllowed=\"Yes\",IF(AND(G639 = \"Yes\", C639<E639), \"Yes\", \"No\"),\"No\")","v":"No"},{"$f":"IF(I639 = \"Yes\", M638/(C639+CostBuy), IF(J639 = \"Yes\", 0, K638))","v":19401.417304834838},null,{"$f":"IF(I639 = \"Yes\", M638-(C639+CostBuy)*K639, IF(J639=\"Yes\", M638+(C639-CostSell)*K638, M638+K639*Rate))","v":15521.133843867867}]
[null,1923.03,9.43,9.0133333333333336,8.9274999999999984,null,"Yes",null,{"$f":"IF(BuyAllowed=\"Yes\",IF(AND(G640 = \"No\", C640>D640), \"Yes\", \"No\"),\"No\")","v":"No"},{"$f":"IF(SellAllowed=\"Yes\",IF(AND(G640 = \"Yes\", C640<E640), \"Yes\", \"No\"),\"No\")","v":"No"},{"$f":"IF(I640 = \"Yes\", M639/(C640+CostBuy), IF(J640 = \"Yes\", 0, K639))","v":19401.417304834838},null,{"$f":"IF(I640 = \"Yes\", M639-(C640+CostBuy)*K640, IF(J640=\"Yes\", M639+(C640-CostSell)*K639, M639+K640*Rate))","v":16491.20470910961}]
[null,1923.04,9.1,9.0750000000000011,9.0425000000000004,null,"Yes",null,{"$f":"IF(BuyAllowed=\"Yes\",IF(AND(G641 = \"No\", C641>D641), \"Yes\", \"No\"),\"No\")","v":"No"},{"$f":"IF(SellAllowed=\"Yes\",IF(AND(G641 = \"Yes\", C641<E641), \"Yes\", \"No\"),\"No\")","v":"No"},{"$f":"IF(I641 = \"Yes\", M640/(C641+CostBuy), IF(J641 = \"Yes\", 0, K640))","v":19401.417304834838},null,{"$f":"IF(I641 = \"Yes\", M640-(C641+CostBuy)*K641, IF(J641=\"Yes\", M640+(C641-CostSell)*K640, M640+K641*Rate))","v":17461.275574351352}]
[null,1923.05,8.67,9.0483333333333338,9.0762499999999999,null,"Yes",null,{"$f":"IF(BuyAllowed=\"Yes\",IF(AND(G642 = \"No\", C642>D642), \"Yes\", \"No\"),\"No\")","v":"No"},{"$f":"IF(SellAllowed=\"Yes\",IF(AND(G642 = \"Yes\", C642<E642), \"Yes\", \"No\"),\"No\")","v":"Yes"},{"$f":"IF(I642 = \"Yes\", M641/(C642+CostBuy), IF(J642 = \"Yes\", 0, K641))","v":0},null,{"$f":"IF(I642 = \"Yes\", M641-(C642+CostBuy)*K642, IF(J642=\"Yes\", M641+(C642-CostSell)*K641, M641+K642*Rate))","v":184507.47856897928}]
[null,1923.06,8.34,9.0266666666666673,9.0274999999999999,null,"No",null,{"$f":"IF(BuyAllowed=\"Yes\",IF(AND(G643 = \"No\", C643>D643), \"Yes\", \"No\"),\"No\")","v":"No"},{"$f":"IF(SellAllowed=\"Yes\",IF(AND(G643 = \"Yes\", C643<E643), \"Yes\", \"No\"),\"No\")","v":"No"},{"$f":"IF(I643 = \"Yes\", M642/(C643+CostBuy), IF(J643 = \"Yes\", 0, K642))","v":0},null,{"$f":"IF(I643 = \"Yes\", M642-(C643+CostBuy)*K643, IF(J643=\"Yes\", M642+(C643-CostSell)*K642, M642+K643*Rate))","v":184507.47856897928}]
[null,1923.07,8.06,8.9533333333333331,8.9124999999999996,null,"No",null,{"$f":"IF(BuyAllowed=\"Yes\",IF(AND(G644 = \"No\", C644>D644), \"Yes\", \"No\"),\"No\")","v":"No"},{"$f":"IF(SellAllowed=\"Yes\",IF(AND(G644 = \"Yes\", C644<E644), \"Yes\", \"No\"),\"No\")","v":"No"},{"$f":"IF(I644 = \"Yes\", M643/(C644+CostBuy), IF(J644 = \"Yes\", 0, K643))","v":0},null,{"$f":"IF(I644 = \"Yes\", M643-(C644+CostBuy)*K644, IF(J644=\"Yes\", M643+(C644-CostSell)*K643, M643+K644*Rate))","v":184507.47856897928}]
[null,1923.08,8.1,8.8133333333333344,8.82,null,"No",null,{"$f":"IF(BuyAllowed=\"Yes\",IF(AND(G645 = \"No\", C645>D645), \"Yes\", \"No\"),\"No\")","v":"No"},{"$f":"IF(SellAllowed=\"Yes\",IF(AND(G645 = \"Yes\", C645<E645), \"Yes\", \"No\"),\"No\")","v":"No"},{"$f":"IF(I645 = \"Yes\", M644/(C645+CostBuy), IF(J645 = \"Yes\", 0, K644))","v":0},null,{"$f":"IF(I645 = \"Yes\", M644-(C645+CostBuy)*K645, IF(J645=\"Yes\", M644+(C645-CostSell)*K644, M644+K645*Rate))","v":184507.47856897928}]
[null,1923.09,8.15,8.6166666666666689,8.7349999999999994,null,"No",null,{"$f":"IF(BuyAllowed=\"Yes\",IF(AND(G646 = \"No\", C646>D646), \"Yes\", \"No\"),\"No\")","v":"No"},{"$f":"IF(SellAllowed=\"Yes\",IF(AND(G646 = \"Yes\", C646<E646), \"Yes\", \"No\"),\"No\")","v":"No"},{"$f":"IF(I646 = \"Yes\", M645/(C646+CostBuy), IF(J646 = \"Yes\", 0, K645))","v":0},null,{"$f":"IF(I646 = \"Yes\", M645-(C646+CostBuy)*K646, IF(J646=\"Yes\", M645+(C646-CostSell)*K645, M645+K646*Rate))","v":184507.47856897928}]
[null,1923.1,8.0299999999999994,8.4033333333333342,8.6412500000000012,null,"No",null,{"$f":"IF(BuyAllowed=\"Yes\",IF(AND(G647 = \"No\", C647>D647), \"Yes\", \"No\"),\"No\")","v":"No"},{"$f":"IF(SellAllowed=\"Yes\",IF(AND(G647 = \"Yes\", C647<E647), \"Yes\", \"No\"),\"No\")","v":"No"},{"$f":"IF(I647 = \"Yes\", M646/(C647+CostBuy), IF(J647 = \"Yes\", 0, K646))","v":0},null,{"$f":"IF(I647 = \"Yes\", M646-(C647+CostBuy)*K647, IF(J647=\"Yes\", M646+(C647-CostSell)*K646, M646+K647*Rate))","v":184507.47856897928}]
[null,1923.11,8.27,8.2249999999999996,8.4850000000000012,null,"No",null,{"$f":"IF(BuyAllowed=\"Yes\",IF(AND(G648 = \"No\", C648>D648), \"Yes\", \"No\"),\"No\")","v":"Yes"},{"$f":"IF(SellAllowed=\"Yes\",IF(AND(G648 = \"Yes\", C648<E648), \"Yes\", \"No\"),\"No\")","v":"No"},{"$f":"IF(I648 = \"Yes\", M647/(C648+CostBuy), IF(J648 = \"Yes\", 0, K647))","v":22229.816695057747},null,{"$f":"IF(I648 = \"Yes\", M647-(C648+CostBuy)*K648, IF(J648=\"Yes\", M647+(C648-CostSell)*K647, M647+K648*Rate))","v":0}]
[null,1923.12,8.5500000000000007,8.1583333333333332,8.34,null,"Yes",null,{"$f":"IF(BuyAllowed=\"Yes\",IF(AND(G649 = \"No\", C649>D649), \"Yes\", \"No\"),\"No\")","v":"No"},{"$f":"IF(SellAllowed=\"Yes\",IF(AND(G649 = \"Yes\", C649<E649), \"Yes\", \"No\"),\"No\")","v":"No"},{"$f":"IF(I649 = \"Yes\", M648/(C649+CostBuy), IF(J649 = \"Yes\", 0, K648))","v":22229.816695057747},null,{"$f":"IF(I649 = \"Yes\", M648-(C649+CostBuy)*K649, IF(J649=\"Yes\", M648+(C649-CostSell)*K648, M648+K649*Rate))","v":1111.4908347528874}]
[null,1924.01,8.83,8.1933333333333334,8.2712500000000002,null,"Yes",null,{"$f":"IF(BuyAllowed=\"Yes\",IF(AND(G650 = \"No\", C650>D650), \"Yes\", \"No\"),\"No\")","v":"No"},{"$f":"IF(SellAllowed=\"Yes\",IF(AND(G650 = \"Yes\", C650<E650), \"Yes\", \"No\"),\"No\")","v":"No"},{"$f":"IF(I650 = \"Yes\", M649/(C650+CostBuy), IF(J650 = \"Yes\", 0, K649))","v":22229.816695057747},null,{"$f":"IF(I650 = \"Yes\", M649-(C650+CostBuy)*K650, IF(J650=\"Yes\", M649+(C650-CostSell)*K649, M649+K650*Rate))","v":2222.9816695057748}]
[null,1924.02,8.8699999999999992,8.3216666666666654,8.2912499999999998,null,"Yes",null,{"$f":"IF(BuyAllowed=\"Yes\",IF(AND(G651 = \"No\", C651>D651), \"Yes\", \"No\"),\"No\")","v":"No"},{"$f":"IF(SellAllowed=\"Yes\",IF(AND(G651 = \"Yes\", C651<E651), \"Yes\", \"No\"),\"No\")","v":"No"},{"$f":"IF(I651 = \"Yes\", M650/(C651+CostBuy), IF(J651 = \"Yes\", 0, K650))","v":22229.816695057747},null,{"$f":"IF(I651 = \"Yes\", M650-(C651+CostBuy)*K651, IF(J651=\"Yes\", M650+(C651-CostSell)*K650, M650+K651*Rate))","v":3334.4725042586624}]
[null,1924.03,8.6999999999999993,8.4499999999999993,8.3574999999999999,null,"Yes",null,{"$f":"IF(BuyAllowed=\"Yes\",IF(AND(G652 = \"No\", C652>D652), \"Yes\", \"No\"),\"No\")","v":"No"},{"$f":"IF(SellAllowed=\"Yes\",IF(AND(G652 = \"Yes\", C652<E652), \"Yes\", \"No\"),\"No\")","v":"No"},{"$f":"IF(I652 = \"Yes\", M651/(C652+CostBuy), IF(J652 = \"Yes\", 0, K651))","v":22229.816695057747},null,{"$f":"IF(I652 = \"Yes\", M651-(C652+CostBuy)*K652, IF(J652=\"Yes\", M651+(C652-CostSell)*K651, M651+K652*Rate))","v":4445.9633390115496}]
[null,1924.04,8.5,8.5416666666666661,8.4374999999999982,null,"Yes",null,{"$f":"IF(BuyAllowed=\"Yes\",IF(AND(G653 = \"No\", C653>D653), \"Yes\", \"No\"),\"No\")","v":"No"},{"$f":"IF(SellAllowed=\"Yes\",IF(AND(G653 = \"Yes\", C653<E653), \"Yes\", \"No\"),\"No\")","v":"No"},{"$f":"IF(I653 = \"Yes\", M652/(C653+CostBuy), IF(J653 = \"Yes\", 0, K652))","v":22229.816695057747},null,{"$f":"IF(I653 = \"Yes\", M652-(C653+CostBuy)*K653, IF(J653=\"Yes\", M652+(C653-CostSell)*K652, M652+K653*Rate))","v":5557.4541737644367}]
[null,1924.05,8.4700000000000006,8.6199999999999992,8.4874999999999989,null,"Yes",null,{"$f":"IF(BuyAllowed=\"Yes\",IF(AND(G654 = \"No\", C654>D654), \"Yes\", \"No\"),\"No\")","v":"No"},{"$f":"IF(SellAllowed=\"Yes\",IF(AND(G654 = \"Yes\", C654<E654), \"Yes\", \"No\"),\"No\")","v":"Yes"},{"$f":"IF(I654 = \"Yes\", M653/(C654+CostBuy), IF(J654 = \"Yes\", 0, K653))","v":0},null,{"$f":"IF(I654 = \"Yes\", M653-(C654+CostBuy)*K654, IF(J654=\"Yes\", M653+(C654-CostSell)*K653, M653+K654*Rate))","v":192510.2125792001}]
[null,1924.06,8.6300000000000008,8.6533333333333342,8.5274999999999999,null,"No",null,{"$f":"IF(BuyAllowed=\"Yes\",IF(AND(G655 = \"No\", C655>D655), \"Yes\", \"No\"),\"No\")","v":"No"},{"$f":"IF(SellAllowed=\"Yes\",IF(AND(G655 = \"Yes\", C655<E655), \"Yes\", \"No\"),\"No\")","v":"No"},{"$f":"IF(I655 = \"Yes\", M654/(C655+CostBuy), IF(J655 = \"Yes\", 0, K654))","v":0},null,{"$f":"IF(I655 = \"Yes\", M654-(C655+CostBuy)*K655, IF(J655=\"Yes\", M654+(C655-CostSell)*K654, M654+K655*Rate))","v":192510.2125792001}]
[null,1924.07,9.0299999999999994,8.6666666666666661,8.6024999999999991,null,"No",null,{"$f":"IF(BuyAllowed=\"Yes\",IF(AND(G656 = \"No\", C656>D656), \"Yes\", \"No\"),\"No\")","v":"Yes"},{"$f":"IF(SellAllowed=\"Yes\",IF(AND(G656 = \"Yes\", C656<E656), \"Yes\", \"No\"),\"No\")","v":"No"},{"$f":"IF(I656 = \"Yes\", M655/(C656+CostBuy), IF(J656 = \"Yes\", 0, K655))","v":21248.367834348799},null,{"$f":"IF(I656 = \"Yes\", M655-(C656+CostBuy)*K656, IF(J656=\"Yes\", M655+(C656-CostSell)*K655, M655+K656*Rate))","v":0}]
[null,1924.08,9.34,8.7000000000000011,8.6974999999999998,null,"Yes",null,{"$f":"IF(BuyAllowed=\"Yes\",IF(AND(G657 = \"No\", C657>D657), \"Yes\", \"No\"),\"No\")","v":"No"},{"$f":"IF(SellAllowed=\"Yes\",IF(AND(G657 = \"Yes\", C657<E657), \"Yes\", \"No\"),\"No\")","v":"No"},{"$f":"IF(I657 = \"Yes\", M656/(C657+CostBuy), IF(J657 = \"Yes\", 0, K656))","v":21248.367834348799},null,{"$f":"IF(I657 = \"Yes\", M656-(C657+CostBuy)*K657, IF(J657=\"Yes\", M656+(C657-CostSell)*K656, M656+K657*Rate))","v":1062.41839171744}]
[null,1924.09,9.25,8.7783333333333342,8.7962500000000006,null,"Yes",null,{"$f":"IF(BuyAllowed=\"Yes\",IF(AND(G658 = \"No\", C658>D658), \"Yes\", \"No\"),\"No\")","v":"No"},{"$f":"IF(SellAllowed=\"Yes\",IF(AND(G658 = \"Yes\", C658<E658), \"Yes\", \"No\"),\"No\")","v":"No"},{"$f":"IF(I658 = \"Yes\", M657/(C658+CostBuy), IF(J658 = \"Yes\", 0, K657))","v":21248.367834348799},null,{"$f":"IF(I658 = \"Yes\", M657-(C658+CostBuy)*K658, IF(J658=\"Yes\", M657+(C658-CostSell)*K657, M657+K658*Rate))","v":2124.8367834348801}]
[null,1924.1,9.1300000000000008,8.8699999999999992,8.8487500000000008,null,"Yes",null,{"$f":"IF(BuyAllowed=\"Yes\",IF(AND(G659 = \"No\", C659>D659), \"Yes\", \"No\"),\"No\")","v":"No"},{"$f":"IF(SellAllowed=\"Yes\",IF(AND(G659 = \"Yes\", C659<E659), \"Yes\", \"No\"),\"No\")","v":"No"},{"$f":"IF(I659 = \"Yes\", M658/(C659+CostBuy), IF(J659 = \"Yes\", 0, K658))","v":21248.367834348799},null,{"$f":"IF(I659 = \"Yes\", M658-(C659+CostBuy)*K659, IF(J659=\"Yes\", M658+(C659-CostSell)*K658, M658+K659*Rate))","v":3187.2551751523201}]
[null,1924.11,9.64,8.9749999999999996,8.8812499999999996,null,"Yes",null,{"$f":"IF(BuyAllowed=\"Yes\",IF(AND(G660 = \"No\", C660>D660), \"Yes\", \"No\"),\"No\")","v":"No"},{"$f":"IF(SellAllowed=\"Yes\",IF(AND(G660 = \"Yes\", C660<E660), \"Yes\", \"No\"),\"No\")","v":"No"},{"$f":"IF(I660 = \"Yes\", M659/(C660+CostBuy), IF(J660 = \"Yes\", 0, K659))","v":21248.367834348799},null,{"$f":"IF(I660 = \"Yes\", M659-(C660+CostBuy)*K660, IF(J660=\"Yes\", M659+(C660-CostSell)*K659, M659+K660*Rate))","v":4249.6735668697602}]
[null,1924.12,10.16,9.17,8.9987500000000011,null,"Yes",null,{"$f":"IF(BuyAllowed=\"Yes\",IF(AND(G661 = \"No\", C661>D661), \"Yes\", \"No\"),\"No\")","v":"No"},{"$f":"IF(SellAllowed=\"Yes\",IF(AND(G661 = \"Yes\", C661<E661), \"Yes\", \"No\"),\"No\")","v":"No"},{"$f":"IF(I661 = \"Yes\", M660/(C661+CostBuy), IF(J661 = \"Yes\", 0, K660))","v":21248.367834348799},null,{"$f":"IF(I661 = \"Yes\", M660-(C661+CostBuy)*K661, IF(J661=\"Yes\", M660+(C661-CostSell)*K660, M660+K661*Rate))","v":5312.0919585871998}]
[null,1925.01,10.58,9.4249999999999989,9.2062500000000007,null,"Yes",null,{"$f":"IF(BuyAllowed=\"Yes\",IF(AND(G662 = \"No\", C662>D662), \"Yes\", \"No\"),\"No\")","v":"No"},{"$f":"IF(SellAllowed=\"Yes\",IF(AND(G662 = \"Yes\", C662<E662), \"Yes\", \"No\"),\"No\")","v":"No"},{"$f":"IF(I662 = \"Yes\", M661/(C662+CostBuy), IF(J662 = \"Yes\", 0, K661))","v":21248.367834348799},null,{"$f":"IF(I662 = \"Yes\", M661-(C662+CostBuy)*K662, IF(J662=\"Yes\", M661+(C662-CostSell)*K661, M661+K662*Rate))","v":6374.5103503046394}]
[null,1925.02,10.67,9.6833333333333318,9.4700000000000006,null,"Yes",null,{"$f":"IF(BuyAllowed=\"Yes\",IF(AND(G663 = \"No\", C663>D663), \"Yes\", \"No\"),\"No\")","v":"No"},{"$f":"IF(SellAllowed=\"Yes\",IF(AND(G663 = \"Yes\", C663<E663), \"Yes\", \"No\"),\"No\")","v":"No"},{"$f":"IF(I663 = \"Yes\", M662/(C663+CostBuy), IF(J663 = \"Yes\", 0, K662))","v":21248.367834348799},null,{"$f":"IF(I663 = \"Yes\", M662-(C663+CostBuy)*K663, IF(J663=\"Yes\", M662+(C663-CostSell)*K662, M662+K663*Rate))","v":7436.9287420220789}]
[null,1925.03,10.39,9.9050000000000011,9.7249999999999996,null,"Yes",null,{"$f":"IF(BuyAllowed=\"Yes\",IF(AND(G664 = \"No\", C664>D664), \"Yes\", \"No\"),\"No\")","v":"No"},{"$f":"IF(SellAllowed=\"Yes\",IF(AND(G664 = \"Yes\", C664<E664), \"Yes\", \"No\"),\"No\")","v":"No"},{"$f":"IF(I664 = \"Yes\", M663/(C664+CostBuy), IF(J664 = \"Yes\", 0, K663))","v":21248.367834348799},null,{"$f":"IF(I664 = \"Yes\", M663-(C664+CostBuy)*K664, IF(J664=\"Yes\", M663+(C664-CostSell)*K663, M663+K664*Rate))","v":8499.3471337395185}]
[null,1925.04,10.28,10.095000000000001,9.8949999999999996,null,"Yes",null,{"$f":"IF(BuyAllowed=\"Yes\",IF(AND(G665 = \"No\", C665>D665), \"Yes\", \"No\"),\"No\")","v":"No"},{"$f":"IF(SellAllowed=\"Yes\",IF(AND(G665 = \"Yes\", C665<E665), \"Yes\", \"No\"),\"No\")","v":"No"},{"$f":"IF(I665 = \"Yes\", M664/(C665+CostBuy), IF(J665 = \"Yes\", 0, K664))","v":21248.367834348799},null,{"$f":"IF(I665 = \"Yes\", M664-(C665+CostBuy)*K665, IF(J665=\"Yes\", M664+(C665-CostSell)*K664, M664+K665*Rate))","v":9561.7655254569581}]
[null,1925.05,10.61,10.286666666666667,10.012500000000001,null,"Yes",null,{"$f":"IF(BuyAllowed=\"Yes\",IF(AND(G666 = \"No\", C666>D666), \"Yes\", \"No\"),\"No\")","v":"No"},{"$f":"IF(SellAllowed=\"Yes\",IF(AND(G666 = \"Yes\", C666<E666), \"Yes\", \"No\"),\"No\")","v":"No"},{"$f":"IF(I666 = \"Yes\", M665/(C666+CostBuy), IF(J666 = \"Yes\", 0, K665))","v":21248.367834348799},null,{"$f":"IF(I666 = \"Yes\", M665-(C666+CostBuy)*K666, IF(J666=\"Yes\", M665+(C666-CostSell)*K665, M665+K666*Rate))","v":10624.183917174398}]
[null,1925.06,10.8,{"$f":"AVERAGE(C661:C666)","v":10.448333333333334},{"$f":"AVERAGE(C659:C666)","v":10.182500000000001},null,"Yes",null,{"$f":"IF(BuyAllowed=\"Yes\",IF(AND(G667 = \"No\", C667>D667), \"Yes\", \"No\"),\"No\")","v":"No"},{"$f":"IF(SellAllowed=\"Yes\",IF(AND(G667 = \"Yes\", C667<E667), \"Yes\", \"No\"),\"No\")","v":"No"},{"$f":"IF(I667 = \"Yes\", M666/(C667+CostBuy), IF(J667 = \"Yes\", 0, K666))","v":21248.367834348799},null,{"$f":"IF(I667 = \"Yes\", M666-(C667+CostBuy)*K667, IF(J667=\"Yes\", M666+(C667-CostSell)*K666, M666+K667*Rate))","v":11686.602308891837}]
[null,1925.07,11.1,10.555,10.391250000000001,null,{"$f":"IF(I667 = \"Yes\", \"Yes\", IF(J667=\"Yes\", \"No\", G667))","v":"Yes"},null,{"$f":"IF(BuyAllowed=\"Yes\",IF(AND(G668 = \"No\", C668>D668), \"Yes\", \"No\"),\"No\")","v":"No"},{"$f":"IF(SellAllowed=\"Yes\",IF(AND(G668 = \"Yes\", C668<E668), \"Yes\", \"No\"),\"No\")","v":"No"},{"$f":"IF(I668 = \"Yes\", M667/(C668+CostBuy), IF(J668 = \"Yes\", 0, K667))","v":21248.367834348799},null,{"$f":"IF(I668 = \"Yes\", M667-(C668+CostBuy)*K668, IF(J668=\"Yes\", M667+(C668-CostSell)*K667, M667+K668*Rate))","v":12749.020700609277}]
[null,1925.08,11.25,10.641666666666667,10.57375,null,"Yes",null,{"$f":"IF(BuyAllowed=\"Yes\",IF(AND(G669 = \"No\", C669>D669), \"Yes\", \"No\"),\"No\")","v":"No"},{"$f":"IF(SellAllowed=\"Yes\",IF(AND(G669 = \"Yes\", C669<E669), \"Yes\", \"No\"),\"No\")","v":"No"},{"$f":"IF(I669 = \"Yes\", M668/(C669+CostBuy), IF(J669 = \"Yes\", 0, K668))","v":21248.367834348799},null,{"$f":"IF(I669 = \"Yes\", M668-(C669+CostBuy)*K669, IF(J669=\"Yes\", M668+(C669-CostSell)*K668, M668+K669*Rate))","v":13811.439092326716}]
[null,1925.09,11.51,10.738333333333335,10.709999999999999,null,"Yes",null,{"$f":"IF(BuyAllowed=\"Yes\",IF(AND(G670 = \"No\", C670>D670), \"Yes\", \"No\"),\"No\")","v":"No"},{"$f":"IF(SellAllowed=\"Yes\",IF(AND(G670 = \"Yes\", C670<E670), \"Yes\", \"No\"),\"No\")","v":"No"},{"$f":"IF(I670 = \"Yes\", M669/(C670+CostBuy), IF(J670 = \"Yes\", 0, K669))","v":21248.367834348799},null,{"$f":"IF(I670 = \"Yes\", M669-(C670+CostBuy)*K670, IF(J670=\"Yes\", M669+(C670-CostSell)*K669, M669+K670*Rate))","v":14873.857484044156}]
[null,1925.1,11.89,10.924999999999999,10.82625,null,"Yes",null,{"$f":"IF(BuyAllowed=\"Yes\",IF(AND(G671 = \"No\", C671>D671), \"Yes\", \"No\"),\"No\")","v":"No"},{"$f":"IF(SellAllowed=\"Yes\",IF(AND(G671 = \"Yes\", C671<E671), \"Yes\", \"No\"),\"No\")","v":"No"},{"$f":"IF(I671 = \"Yes\", M670/(C671+CostBuy), IF(J671 = \"Yes\", 0, K670))","v":21248.367834348799},null,{"$f":"IF(I671 = \"Yes\", M670-(C671+CostBuy)*K671, IF(J671=\"Yes\", M670+(C671-CostSell)*K670, M670+K671*Rate))","v":15936.275875761596}]
[null,1925.11,12.26,11.193333333333333,10.978750000000002,null,"Yes",null,{"$f":"IF(BuyAllowed=\"Yes\",IF(AND(G672 = \"No\", C672>D672), \"Yes\", \"No\"),\"No\")","v":"No"},{"$f":"IF(SellAllowed=\"Yes\",IF(AND(G672 = \"Yes\", C672<E672), \"Yes\", \"No\"),\"No\")","v":"No"},{"$f":"IF(I672 = \"Yes\", M671/(C672+CostBuy), IF(J672 = \"Yes\", 0, K671))","v":21248.367834348799},null,{"$f":"IF(I672 = \"Yes\", M671-(C672+CostBuy)*K672, IF(J672=\"Yes\", M671+(C672-CostSell)*K671, M671+K672*Rate))","v":16998.694267479037}]
[null,1925.12,12.46,11.468333333333334,11.2125,null,"Yes",null,{"$f":"IF(BuyAllowed=\"Yes\",IF(AND(G673 = \"No\", C673>D673), \"Yes\", \"No\"),\"No\")","v":"No"},{"$f":"IF(SellAllowed=\"Yes\",IF(AND(G673 = \"Yes\", C673<E673), \"Yes\", \"No\"),\"No\")","v":"No"},{"$f":"IF(I673 = \"Yes\", M672/(C673+CostBuy), IF(J673 = \"Yes\", 0, K672))","v":21248.367834348799},null,{"$f":"IF(I673 = \"Yes\", M672-(C673+CostBuy)*K673, IF(J673=\"Yes\", M672+(C673-CostSell)*K672, M672+K673*Rate))","v":18061.112659196478}]
[null,1926.01,12.65,11.744999999999999,11.484999999999999,null,"Yes",null,{"$f":"IF(BuyAllowed=\"Yes\",IF(AND(G674 = \"No\", C674>D674), \"Yes\", \"No\"),\"No\")","v":"No"},{"$f":"IF(SellAllowed=\"Yes\",IF(AND(G674 = \"Yes\", C674<E674), \"Yes\", \"No\"),\"No\")","v":"No"},{"$f":"IF(I674 = \"Yes\", M673/(C674+CostBuy), IF(J674 = \"Yes\", 0, K673))","v":21248.367834348799},null,{"$f":"IF(I674 = \"Yes\", M673-(C674+CostBuy)*K674, IF(J674=\"Yes\", M673+(C674-CostSell)*K673, M673+K674*Rate))","v":19123.53105091392}]
[null,1926.02,12.67,12.003333333333332,11.740000000000002,null,"Yes",null,{"$f":"IF(BuyAllowed=\"Yes\",IF(AND(G675 = \"No\", C675>D675), \"Yes\", \"No\"),\"No\")","v":"No"},{"$f":"IF(SellAllowed=\"Yes\",IF(AND(G675 = \"Yes\", C675<E675), \"Yes\", \"No\"),\"No\")","v":"No"},{"$f":"IF(I675 = \"Yes\", M674/(C675+CostBuy), IF(J675 = \"Yes\", 0, K674))","v":21248.367834348799},null,{"$f":"IF(I675 = \"Yes\", M674-(C675+CostBuy)*K675, IF(J675=\"Yes\", M674+(C675-CostSell)*K674, M674+K675*Rate))","v":20185.949442631361}]
[null,1926.03,11.81,12.24,11.973750000000001,null,"Yes",null,{"$f":"IF(BuyAllowed=\"Yes\",IF(AND(G676 = \"No\", C676>D676), \"Yes\", \"No\"),\"No\")","v":"No"},{"$f":"IF(SellAllowed=\"Yes\",IF(AND(G676 = \"Yes\", C676<E676), \"Yes\", \"No\"),\"No\")","v":"Yes"},{"$f":"IF(I676 = \"Yes\", M675/(C676+CostBuy), IF(J676 = \"Yes\", 0, K675))","v":0},null,{"$f":"IF(I676 = \"Yes\", M675-(C676+CostBuy)*K676, IF(J676=\"Yes\", M675+(C676-CostSell)*K675, M675+K676*Rate))","v":269854.27149622975}]
[null,1926.04,11.48,12.29,12.0625,null,"No",null,{"$f":"IF(BuyAllowed=\"Yes\",IF(AND(G677 = \"No\", C677>D677), \"Yes\", \"No\"),\"No\")","v":"No"},{"$f":"IF(SellAllowed=\"Yes\",IF(AND(G677 = \"Yes\", C677<E677), \"Yes\", \"No\"),\"No\")","v":"No"},{"$f":"IF(I677 = \"Yes\", M676/(C677+CostBuy), IF(J677 = \"Yes\", 0, K676))","v":0},null,{"$f":"IF(I677 = \"Yes\", M676-(C677+CostBuy)*K677, IF(J677=\"Yes\", M676+(C677-CostSell)*K676, M676+K677*Rate))","v":269854.27149622975}]
[null,1926.05,11.56,12.221666666666666,12.09125,null,"No",null,{"$f":"IF(BuyAllowed=\"Yes\",IF(AND(G678 = \"No\", C678>D678), \"Yes\", \"No\"),\"No\")","v":"No"},{"$f":"IF(SellAllowed=\"Yes\",IF(AND(G678 = \"Yes\", C678<E678), \"Yes\", \"No\"),\"No\")","v":"No"},{"$f":"IF(I678 = \"Yes\", M677/(C678+CostBuy), IF(J678 = \"Yes\", 0, K677))","v":0},null,{"$f":"IF(I678 = \"Yes\", M677-(C678+CostBuy)*K678, IF(J678=\"Yes\", M677+(C678-CostSell)*K677, M677+K678*Rate))","v":269854.27149622975}]
[null,1926.06,12.11,12.105000000000002,12.0975,null,"No",null,{"$f":"IF(BuyAllowed=\"Yes\",IF(AND(G679 = \"No\", C679>D679), \"Yes\", \"No\"),\"No\")","v":"Yes"},{"$f":"IF(SellAllowed=\"Yes\",IF(AND(G679 = \"Yes\", C679<E679), \"Yes\", \"No\"),\"No\")","v":"No"},{"$f":"IF(I679 = \"Yes\", M678/(C679+CostBuy), IF(J679 = \"Yes\", 0, K678))","v":22228.523187498333},null,{"$f":"IF(I679 = \"Yes\", M678-(C679+CostBuy)*K679, IF(J679=\"Yes\", M678+(C679-CostSell)*K678, M678+K679*Rate))","v":0}]
[null,1926.07,12.62,12.046666666666667,12.125,null,"Yes",null,{"$f":"IF(BuyAllowed=\"Yes\",IF(AND(G680 = \"No\", C680>D680), \"Yes\", \"No\"),\"No\")","v":"No"},{"$f":"IF(SellAllowed=\"Yes\",IF(AND(G680 = \"Yes\", C680<E680), \"Yes\", \"No\"),\"No\")","v":"No"},{"$f":"IF(I680 = \"Yes\", M679/(C680+CostBuy), IF(J680 = \"Yes\", 0, K679))","v":22228.523187498333},null,{"$f":"IF(I680 = \"Yes\", M679-(C680+CostBuy)*K680, IF(J680=\"Yes\", M679+(C680-CostSell)*K679, M679+K680*Rate))","v":1111.4261593749168}]
[null,1926.08,13.12,12.041666666666666,12.170000000000002,null,"Yes",null,{"$f":"IF(BuyAllowed=\"Yes\",IF(AND(G681 = \"No\", C681>D681), \"Yes\", \"No\"),\"No\")","v":"No"},{"$f":"IF(SellAllowed=\"Yes\",IF(AND(G681 = \"Yes\", C681<E681), \"Yes\", \"No\"),\"No\")","v":"No"},{"$f":"IF(I681 = \"Yes\", M680/(C681+CostBuy), IF(J681 = \"Yes\", 0, K680))","v":22228.523187498333},null,{"$f":"IF(I681 = \"Yes\", M680-(C681+CostBuy)*K681, IF(J681=\"Yes\", M680+(C681-CostSell)*K680, M680+K681*Rate))","v":2222.8523187498336}]
[null,1926.09,13.32,12.116666666666667,12.252500000000001,null,"Yes",null,{"$f":"IF(BuyAllowed=\"Yes\",IF(AND(G682 = \"No\", C682>D682), \"Yes\", \"No\"),\"No\")","v":"No"},{"$f":"IF(SellAllowed=\"Yes\",IF(AND(G682 = \"Yes\", C682<E682), \"Yes\", \"No\"),\"No\")","v":"No"},{"$f":"IF(I682 = \"Yes\", M681/(C682+CostBuy), IF(J682 = \"Yes\", 0, K681))","v":22228.523187498333},null,{"$f":"IF(I682 = \"Yes\", M681-(C682+CostBuy)*K682, IF(J682=\"Yes\", M681+(C682-CostSell)*K681, M681+K682*Rate))","v":3334.2784781247501}]
[null,1926.1,13.02,12.368333333333332,12.33625,null,"Yes",null,{"$f":"IF(BuyAllowed=\"Yes\",IF(AND(G683 = \"No\", C683>D683), \"Yes\", \"No\"),\"No\")","v":"No"},{"$f":"IF(SellAllowed=\"Yes\",IF(AND(G683 = \"Yes\", C683<E683), \"Yes\", \"No\"),\"No\")","v":"No"},{"$f":"IF(I683 = \"Yes\", M682/(C683+CostBuy), IF(J683 = \"Yes\", 0, K682))","v":22228.523187498333},null,{"$f":"IF(I683 = \"Yes\", M682-(C683+CostBuy)*K683, IF(J683=\"Yes\", M682+(C683-CostSell)*K682, M682+K683*Rate))","v":4445.7046374996671}]
[null,1926.11,13.19,12.625,12.38,null,"Yes",null,{"$f":"IF(BuyAllowed=\"Yes\",IF(AND(G684 = \"No\", C684>D684), \"Yes\", \"No\"),\"No\")","v":"No"},{"$f":"IF(SellAllowed=\"Yes\",IF(AND(G684 = \"Yes\", C684<E684), \"Yes\", \"No\"),\"No\")","v":"No"},{"$f":"IF(I684 = \"Yes\", M683/(C684+CostBuy), IF(J684 = \"Yes\", 0, K683))","v":22228.523187498333},null,{"$f":"IF(I684 = \"Yes\", M683-(C684+CostBuy)*K684, IF(J684=\"Yes\", M683+(C684-CostSell)*K683, M683+K684*Rate))","v":5557.1307968745841}]
[null,1926.12,13.49,12.896666666666667,12.552499999999998,null,"Yes",null,{"$f":"IF(BuyAllowed=\"Yes\",IF(AND(G685 = \"No\", C685>D685), \"Yes\", \"No\"),\"No\")","v":"No"},{"$f":"IF(SellAllowed=\"Yes\",IF(AND(G685 = \"Yes\", C685<E685), \"Yes\", \"No\"),\"No\")","v":"No"},{"$f":"IF(I685 = \"Yes\", M684/(C685+CostBuy), IF(J685 = \"Yes\", 0, K684))","v":22228.523187498333},null,{"$f":"IF(I685 = \"Yes\", M684-(C685+CostBuy)*K685, IF(J685=\"Yes\", M684+(C685-CostSell)*K684, M684+K685*Rate))","v":6668.5569562495011}]
[null,1927.01,13.4,13.126666666666665,12.803749999999999,null,"Yes",null,{"$f":"IF(BuyAllowed=\"Yes\",IF(AND(G686 = \"No\", C686>D686), \"Yes\", \"No\"),\"No\")","v":"No"},{"$f":"IF(SellAllowed=\"Yes\",IF(AND(G686 = \"Yes\", C686<E686), \"Yes\", \"No\"),\"No\")","v":"No"},{"$f":"IF(I686 = \"Yes\", M685/(C686+CostBuy), IF(J686 = \"Yes\", 0, K685))","v":22228.523187498333},null,{"$f":"IF(I686 = \"Yes\", M685-(C686+CostBuy)*K686, IF(J686=\"Yes\", M685+(C686-CostSell)*K685, M685+K686*Rate))","v":7779.9831156244181}]
[null,1927.02,13.66,13.256666666666666,13.03375,null,"Yes",null,{"$f":"IF(BuyAllowed=\"Yes\",IF(AND(G687 = \"No\", C687>D687), \"Yes\", \"No\"),\"No\")","v":"No"},{"$f":"IF(SellAllowed=\"Yes\",IF(AND(G687 = \"Yes\", C687<E687), \"Yes\", \"No\"),\"No\")","v":"No"},{"$f":"IF(I687 = \"Yes\", M686/(C687+CostBuy), IF(J687 = \"Yes\", 0, K686))","v":22228.523187498333},null,{"$f":"IF(I687 = \"Yes\", M686-(C687+CostBuy)*K687, IF(J687=\"Yes\", M686+(C687-CostSell)*K686, M686+K687*Rate))","v":8891.4092749993342}]
[null,1927.03,13.87,13.346666666666666,13.227499999999999,null,"Yes",null,{"$f":"IF(BuyAllowed=\"Yes\",IF(AND(G688 = \"No\", C688>D688), \"Yes\", \"No\"),\"No\")","v":"No"},{"$f":"IF(SellAllowed=\"Yes\",IF(AND(G688 = \"Yes\", C688<E688), \"Yes\", \"No\"),\"No\")","v":"No"},{"$f":"IF(I688 = \"Yes\", M687/(C688+CostBuy), IF(J688 = \"Yes\", 0, K687))","v":22228.523187498333},null,{"$f":"IF(I688 = \"Yes\", M687-(C688+CostBuy)*K688, IF(J688=\"Yes\", M687+(C688-CostSell)*K687, M687+K688*Rate))","v":10002.83543437425}]
[null,1927.04,14.21,13.438333333333334,13.383749999999999,null,"Yes",null,{"$f":"IF(BuyAllowed=\"Yes\",IF(AND(G689 = \"No\", C689>D689), \"Yes\", \"No\"),\"No\")","v":"No"},{"$f":"IF(SellAllowed=\"Yes\",IF(AND(G689 = \"Yes\", C689<E689), \"Yes\", \"No\"),\"No\")","v":"No"},{"$f":"IF(I689 = \"Yes\", M688/(C689+CostBuy), IF(J689 = \"Yes\", 0, K688))","v":22228.523187498333},null,{"$f":"IF(I689 = \"Yes\", M688-(C689+CostBuy)*K689, IF(J689=\"Yes\", M688+(C689-CostSell)*K688, M688+K689*Rate))","v":11114.261593749166}]
[null,1927.05,14.7,13.636666666666665,13.52,null,"Yes",null,{"$f":"IF(BuyAllowed=\"Yes\",IF(AND(G690 = \"No\", C690>D690), \"Yes\", \"No\"),\"No\")","v":"No"},{"$f":"IF(SellAllowed=\"Yes\",IF(AND(G690 = \"Yes\", C690<E690), \"Yes\", \"No\"),\"No\")","v":"No"},{"$f":"IF(I690 = \"Yes\", M689/(C690+CostBuy), IF(J690 = \"Yes\", 0, K689))","v":22228.523187498333},null,{"$f":"IF(I690 = \"Yes\", M689-(C690+CostBuy)*K690, IF(J690=\"Yes\", M689+(C690-CostSell)*K689, M689+K690*Rate))","v":12225.687753124083}]
[null,1927.06,14.89,13.888333333333334,13.692500000000001,null,"Yes",null,{"$f":"IF(BuyAllowed=\"Yes\",IF(AND(G691 = \"No\", C691>D691), \"Yes\", \"No\"),\"No\")","v":"No"},{"$f":"IF(SellAllowed=\"Yes\",IF(AND(G691 = \"Yes\", C691<E691), \"Yes\", \"No\"),\"No\")","v":"No"},{"$f":"IF(I691 = \"Yes\", M690/(C691+CostBuy), IF(J691 = \"Yes\", 0, K690))","v":22228.523187498333},null,{"$f":"IF(I691 = \"Yes\", M690-(C691+CostBuy)*K691, IF(J691=\"Yes\", M690+(C691-CostSell)*K690, M690+K691*Rate))","v":13337.113912498999}]
[null,1927.07,15.22,14.121666666666668,13.92625,null,"Yes",null,{"$f":"IF(BuyAllowed=\"Yes\",IF(AND(G692 = \"No\", C692>D692), \"Yes\", \"No\"),\"No\")","v":"No"},{"$f":"IF(SellAllowed=\"Yes\",IF(AND(G692 = \"Yes\", C692<E692), \"Yes\", \"No\"),\"No\")","v":"No"},{"$f":"IF(I692 = \"Yes\", M691/(C692+CostBuy), IF(J692 = \"Yes\", 0, K691))","v":22228.523187498333},null,{"$f":"IF(I692 = \"Yes\", M691-(C692+CostBuy)*K692, IF(J692=\"Yes\", M691+(C692-CostSell)*K691, M691+K692*Rate))","v":14448.540071873915}]
[null,1927.08,16.03,14.424999999999999,14.18,null,"Yes",null,{"$f":"IF(BuyAllowed=\"Yes\",IF(AND(G693 = \"No\", C693>D693), \"Yes\", \"No\"),\"No\")","v":"No"},{"$f":"IF(SellAllowed=\"Yes\",IF(AND(G693 = \"Yes\", C693<E693), \"Yes\", \"No\"),\"No\")","v":"No"},{"$f":"IF(I693 = \"Yes\", M692/(C693+CostBuy), IF(J693 = \"Yes\", 0, K692))","v":22228.523187498333},null,{"$f":"IF(I693 = \"Yes\", M692-(C693+CostBuy)*K693, IF(J693=\"Yes\", M692+(C693-CostSell)*K692, M692+K693*Rate))","v":15559.966231248831}]
[null,1927.09,16.940000000000001,14.82,14.4975,null,"Yes",null,{"$f":"IF(BuyAllowed=\"Yes\",IF(AND(G694 = \"No\", C694>D694), \"Yes\", \"No\"),\"No\")","v":"No"},{"$f":"IF(SellAllowed=\"Yes\",IF(AND(G694 = \"Yes\", C694<E694), \"Yes\", \"No\"),\"No\")","v":"No"},{"$f":"IF(I694 = \"Yes\", M693/(C694+CostBuy), IF(J694 = \"Yes\", 0, K693))","v":22228.523187498333},null,{"$f":"IF(I694 = \"Yes\", M693-(C694+CostBuy)*K694, IF(J694=\"Yes\", M693+(C694-CostSell)*K693, M693+K694*Rate))","v":16671.392390623747}]
[null,1927.1,16.68,15.331666666666665,14.94,null,"Yes",null,{"$f":"IF(BuyAllowed=\"Yes\",IF(AND(G695 = \"No\", C695>D695), \"Yes\", \"No\"),\"No\")","v":"No"},{"$f":"IF(SellAllowed=\"Yes\",IF(AND(G695 = \"Yes\", C695<E695), \"Yes\", \"No\"),\"No\")","v":"No"},{"$f":"IF(I695 = \"Yes\", M694/(C695+CostBuy), IF(J695 = \"Yes\", 0, K694))","v":22228.523187498333},null,{"$f":"IF(I695 = \"Yes\", M694-(C695+CostBuy)*K695, IF(J695=\"Yes\", M694+(C695-CostSell)*K694, M694+K695*Rate))","v":17782.818549998665}]
[null,1927.11,17.059999999999999,15.743333333333334,15.317499999999999,null,"Yes",null,{"$f":"IF(BuyAllowed=\"Yes\",IF(AND(G696 = \"No\", C696>D696), \"Yes\", \"No\"),\"No\")","v":"No"},{"$f":"IF(SellAllowed=\"Yes\",IF(AND(G696 = \"Yes\", C696<E696), \"Yes\", \"No\"),\"No\")","v":"No"},{"$f":"IF(I696 = \"Yes\", M695/(C696+CostBuy), IF(J696 = \"Yes\", 0, K695))","v":22228.523187498333},null,{"$f":"IF(I696 = \"Yes\", M695-(C696+CostBuy)*K696, IF(J696=\"Yes\", M695+(C696-CostSell)*K695, M695+K696*Rate))","v":18894.244709373583}]
[null,1927.12,17.46,16.136666666666667,15.716249999999999,null,"Yes",null,{"$f":"IF(BuyAllowed=\"Yes\",IF(AND(G697 = \"No\", C697>D697), \"Yes\", \"No\"),\"No\")","v":"No"},{"$f":"IF(SellAllowed=\"Yes\",IF(AND(G697 = \"Yes\", C697<E697), \"Yes\", \"No\"),\"No\")","v":"No"},{"$f":"IF(I697 = \"Yes\", M696/(C697+CostBuy), IF(J697 = \"Yes\", 0, K696))","v":22228.523187498333},null,{"$f":"IF(I697 = \"Yes\", M696-(C697+CostBuy)*K697, IF(J697=\"Yes\", M696+(C697-CostSell)*K696, M696+K697*Rate))","v":20005.670868748501}]
[null,1928.01,17.53,16.565000000000001,16.122500000000002,null,"Yes",null,{"$f":"IF(BuyAllowed=\"Yes\",IF(AND(G698 = \"No\", C698>D698), \"Yes\", \"No\"),\"No\")","v":"No"},{"$f":"IF(SellAllowed=\"Yes\",IF(AND(G698 = \"Yes\", C698<E698), \"Yes\", \"No\"),\"No\")","v":"No"},{"$f":"IF(I698 = \"Yes\", M697/(C698+CostBuy), IF(J698 = \"Yes\", 0, K697))","v":22228.523187498333},null,{"$f":"IF(I698 = \"Yes\", M697-(C698+CostBuy)*K698, IF(J698=\"Yes\", M697+(C698-CostSell)*K697, M697+K698*Rate))","v":21117.097028123419}]
[null,1928.02,17.32,16.95,16.47625,null,"Yes",null,{"$f":"IF(BuyAllowed=\"Yes\",IF(AND(G699 = \"No\", C699>D699), \"Yes\", \"No\"),\"No\")","v":"No"},{"$f":"IF(SellAllowed=\"Yes\",IF(AND(G699 = \"Yes\", C699<E699), \"Yes\", \"No\"),\"No\")","v":"No"},{"$f":"IF(I699 = \"Yes\", M698/(C699+CostBuy), IF(J699 = \"Yes\", 0, K698))","v":22228.523187498333},null,{"$f":"IF(I699 = \"Yes\", M698-(C699+CostBuy)*K699, IF(J699=\"Yes\", M698+(C699-CostSell)*K698, M698+K699*Rate))","v":22228.523187498336}]
[null,1928.03,18.25,17.165000000000003,16.78,null,"Yes",null,{"$f":"IF(BuyAllowed=\"Yes\",IF(AND(G700 = \"No\", C700>D700), \"Yes\", \"No\"),\"No\")","v":"No"},{"$f":"IF(SellAllowed=\"Yes\",IF(AND(G700 = \"Yes\", C700<E700), \"Yes\", \"No\"),\"No\")","v":"No"},{"$f":"IF(I700 = \"Yes\", M699/(C700+CostBuy), IF(J700 = \"Yes\", 0, K699))","v":22228.523187498333},null,{"$f":"IF(I700 = \"Yes\", M699-(C700+CostBuy)*K700, IF(J700=\"Yes\", M699+(C700-CostSell)*K699, M699+K700*Rate))","v":23339.949346873254}]
[null,1928.04,19.399999999999999,17.383333333333329,17.158749999999998,null,"Yes",null,{"$f":"IF(BuyAllowed=\"Yes\",IF(AND(G701 = \"No\", C701>D701), \"Yes\", \"No\"),\"No\")","v":"No"},{"$f":"IF(SellAllowed=\"Yes\",IF(AND(G701 = \"Yes\", C701<E701), \"Yes\", \"No\"),\"No\")","v":"No"},{"$f":"IF(I701 = \"Yes\", M700/(C701+CostBuy), IF(J701 = \"Yes\", 0, K700))","v":22228.523187498333},null,{"$f":"IF(I701 = \"Yes\", M700-(C701+CostBuy)*K701, IF(J701=\"Yes\", M700+(C701-CostSell)*K700, M700+K701*Rate))","v":24451.375506248172}]
[null,1928.05,20,17.83666666666667,17.580000000000002,null,"Yes",null,{"$f":"IF(BuyAllowed=\"Yes\",IF(AND(G702 = \"No\", C702>D702), \"Yes\", \"No\"),\"No\")","v":"No"},{"$f":"IF(SellAllowed=\"Yes\",IF(AND(G702 = \"Yes\", C702<E702), \"Yes\", \"No\"),\"No\")","v":"No"},{"$f":"IF(I702 = \"Yes\", M701/(C702+CostBuy), IF(J702 = \"Yes\", 0, K701))","v":22228.523187498333},null,{"$f":"IF(I702 = \"Yes\", M701-(C702+CostBuy)*K702, IF(J702=\"Yes\", M701+(C702-CostSell)*K701, M701+K702*Rate))","v":25562.80166562309}]
[null,1928.06,19.02,18.326666666666668,17.962499999999999,null,"Yes",null,{"$f":"IF(BuyAllowed=\"Yes\",IF(AND(G703 = \"No\", C703>D703), \"Yes\", \"No\"),\"No\")","v":"No"},{"$f":"IF(SellAllowed=\"Yes\",IF(AND(G703 = \"Yes\", C703<E703), \"Yes\", \"No\"),\"No\")","v":"No"},{"$f":"IF(I703 = \"Yes\", M702/(C703+CostBuy), IF(J703 = \"Yes\", 0, K702))","v":22228.523187498333},null,{"$f":"IF(I703 = \"Yes\", M702-(C703+CostBuy)*K703, IF(J703=\"Yes\", M702+(C703-CostSell)*K702, M702+K703*Rate))","v":26674.227824998008}]
[null,1928.07,19.16,18.586666666666666,18.255000000000003,null,"Yes",null,{"$f":"IF(BuyAllowed=\"Yes\",IF(AND(G704 = \"No\", C704>D704), \"Yes\", \"No\"),\"No\")","v":"No"},{"$f":"IF(SellAllowed=\"Yes\",IF(AND(G704 = \"Yes\", C704<E704), \"Yes\", \"No\"),\"No\")","v":"No"},{"$f":"IF(I704 = \"Yes\", M703/(C704+CostBuy), IF(J704 = \"Yes\", 0, K703))","v":22228.523187498333},null,{"$f":"IF(I704 = \"Yes\", M703-(C704+CostBuy)*K704, IF(J704=\"Yes\", M703+(C704-CostSell)*K703, M703+K704*Rate))","v":27785.653984372926}]
[null,1928.08,19.78,18.858333333333331,18.517500000000002,null,"Yes",null,{"$f":"IF(BuyAllowed=\"Yes\",IF(AND(G705 = \"No\", C705>D705), \"Yes\", \"No\"),\"No\")","v":"No"},{"$f":"IF(SellAllowed=\"Yes\",IF(AND(G705 = \"Yes\", C705<E705), \"Yes\", \"No\"),\"No\")","v":"No"},{"$f":"IF(I705 = \"Yes\", M704/(C705+CostBuy), IF(J705 = \"Yes\", 0, K704))","v":22228.523187498333},null,{"$f":"IF(I705 = \"Yes\", M704-(C705+CostBuy)*K705, IF(J705=\"Yes\", M704+(C705-CostSell)*K704, M704+K705*Rate))","v":28897.080143747844}]
[null,1928.09,21.17,19.268333333333334,18.807500000000001,null,"Yes",null,{"$f":"IF(BuyAllowed=\"Yes\",IF(AND(G706 = \"No\", C706>D706), \"Yes\", \"No\"),\"No\")","v":"No"},{"$f":"IF(SellAllowed=\"Yes\",IF(AND(G706 = \"Yes\", C706<E706), \"Yes\", \"No\"),\"No\")","v":"No"},{"$f":"IF(I706 = \"Yes\", M705/(C706+CostBuy), IF(J706 = \"Yes\", 0, K705))","v":22228.523187498333},null,{"$f":"IF(I706 = \"Yes\", M705-(C706+CostBuy)*K706, IF(J706=\"Yes\", M705+(C706-CostSell)*K705, M705+K706*Rate))","v":30008.506303122762}]
[null,1928.1,21.6,19.754999999999999,19.262500000000003,null,"Yes",null,{"$f":"IF(BuyAllowed=\"Yes\",IF(AND(G707 = \"No\", C707>D707), \"Yes\", \"No\"),\"No\")","v":"No"},{"$f":"IF(SellAllowed=\"Yes\",IF(AND(G707 = \"Yes\", C707<E707), \"Yes\", \"No\"),\"No\")","v":"No"},{"$f":"IF(I707 = \"Yes\", M706/(C707+CostBuy), IF(J707 = \"Yes\", 0, K706))","v":22228.523187498333},null,{"$f":"IF(I707 = \"Yes\", M706-(C707+CostBuy)*K707, IF(J707=\"Yes\", M706+(C707-CostSell)*K706, M706+K707*Rate))","v":31119.93246249768}]
[null,1928.11,23.06,20.121666666666666,19.797499999999999,null,"Yes",null,{"$f":"IF(BuyAllowed=\"Yes\",IF(AND(G708 = \"No\", C708>D708), \"Yes\", \"No\"),\"No\")","v":"No"},{"$f":"IF(SellAllowed=\"Yes\",IF(AND(G708 = \"Yes\", C708<E708), \"Yes\", \"No\"),\"No\")","v":"No"},{"$f":"IF(I708 = \"Yes\", M707/(C708+CostBuy), IF(J708 = \"Yes\", 0, K707))","v":22228.523187498333},null,{"$f":"IF(I708 = \"Yes\", M707-(C708+CostBuy)*K708, IF(J708=\"Yes\", M707+(C708-CostSell)*K707, M707+K708*Rate))","v":32231.358621872598}]
[null,1928.12,23.15,20.631666666666664,20.39875,null,"Yes",null,{"$f":"IF(BuyAllowed=\"Yes\",IF(AND(G709 = \"No\", C709>D709), \"Yes\", \"No\"),\"No\")","v":"No"},{"$f":"IF(SellAllowed=\"Yes\",IF(AND(G709 = \"Yes\", C709<E709), \"Yes\", \"No\"),\"No\")","v":"No"},{"$f":"IF(I709 = \"Yes\", M708/(C709+CostBuy), IF(J709 = \"Yes\", 0, K708))","v":22228.523187498333},null,{"$f":"IF(I709 = \"Yes\", M708-(C709+CostBuy)*K709, IF(J709=\"Yes\", M708+(C709-CostSell)*K708, M708+K709*Rate))","v":33342.784781247516}]
[null,1929.01,24.86,21.320000000000004,20.8675,null,"Yes",null,{"$f":"IF(BuyAllowed=\"Yes\",IF(AND(G710 = \"No\", C710>D710), \"Yes\", \"No\"),\"No\")","v":"No"},{"$f":"IF(SellAllowed=\"Yes\",IF(AND(G710 = \"Yes\", C710<E710), \"Yes\", \"No\"),\"No\")","v":"No"},{"$f":"IF(I710 = \"Yes\", M709/(C710+CostBuy), IF(J710 = \"Yes\", 0, K709))","v":22228.523187498333},null,{"$f":"IF(I710 = \"Yes\", M709-(C710+CostBuy)*K710, IF(J710=\"Yes\", M709+(C710-CostSell)*K709, M709+K710*Rate))","v":34454.210940622434}]
[null,1929.02,24.99,22.27,21.475000000000001,null,"Yes",null,{"$f":"IF(BuyAllowed=\"Yes\",IF(AND(G711 = \"No\", C711>D711), \"Yes\", \"No\"),\"No\")","v":"No"},{"$f":"IF(SellAllowed=\"Yes\",IF(AND(G711 = \"Yes\", C711<E711), \"Yes\", \"No\"),\"No\")","v":"No"},{"$f":"IF(I711 = \"Yes\", M710/(C711+CostBuy), IF(J711 = \"Yes\", 0, K710))","v":22228.523187498333},null,{"$f":"IF(I711 = \"Yes\", M710-(C711+CostBuy)*K711, IF(J711=\"Yes\", M710+(C711-CostSell)*K710, M710+K711*Rate))","v":35565.637099997351}]
[null,1929.03,25.43,23.138333333333332,22.221250000000005,null,"Yes",null,{"$f":"IF(BuyAllowed=\"Yes\",IF(AND(G712 = \"No\", C712>D712), \"Yes\", \"No\"),\"No\")","v":"No"},{"$f":"IF(SellAllowed=\"Yes\",IF(AND(G712 = \"Yes\", C712<E712), \"Yes\", \"No\"),\"No\")","v":"No"},{"$f":"IF(I712 = \"Yes\", M711/(C712+CostBuy), IF(J712 = \"Yes\", 0, K711))","v":22228.523187498333},null,{"$f":"IF(I712 = \"Yes\", M711-(C712+CostBuy)*K712, IF(J712=\"Yes\", M711+(C712-CostSell)*K711, M711+K712*Rate))","v":36677.063259372269}]
[null,1929.04,25.28,23.848333333333333,23.005000000000003,null,"Yes",null,{"$f":"IF(BuyAllowed=\"Yes\",IF(AND(G713 = \"No\", C713>D713), \"Yes\", \"No\"),\"No\")","v":"No"},{"$f":"IF(SellAllowed=\"Yes\",IF(AND(G713 = \"Yes\", C713<E713), \"Yes\", \"No\"),\"No\")","v":"No"},{"$f":"IF(I713 = \"Yes\", M712/(C713+CostBuy), IF(J713 = \"Yes\", 0, K712))","v":22228.523187498333},null,{"$f":"IF(I713 = \"Yes\", M712-(C713+CostBuy)*K713, IF(J713=\"Yes\", M712+(C713-CostSell)*K712, M712+K713*Rate))","v":37788.489418747187}]
[null,1929.05,25.66,24.461666666666662,23.692499999999999,null,"Yes",null,{"$f":"IF(BuyAllowed=\"Yes\",IF(AND(G714 = \"No\", C714>D714), \"Yes\", \"No\"),\"No\")","v":"No"},{"$f":"IF(SellAllowed=\"Yes\",IF(AND(G714 = \"Yes\", C714<E714), \"Yes\", \"No\"),\"No\")","v":"No"},{"$f":"IF(I714 = \"Yes\", M713/(C714+CostBuy), IF(J714 = \"Yes\", 0, K713))","v":22228.523187498333},null,{"$f":"IF(I714 = \"Yes\", M713-(C714+CostBuy)*K714, IF(J714=\"Yes\", M713+(C714-CostSell)*K713, M713+K714*Rate))","v":38899.915578122105}]
[null,1929.06,26.15,24.895,24.25375,null,"Yes",null,{"$f":"IF(BuyAllowed=\"Yes\",IF(AND(G715 = \"No\", C715>D715), \"Yes\", \"No\"),\"No\")","v":"No"},{"$f":"IF(SellAllowed=\"Yes\",IF(AND(G715 = \"Yes\", C715<E715), \"Yes\", \"No\"),\"No\")","v":"No"},{"$f":"IF(I715 = \"Yes\", M714/(C715+CostBuy), IF(J715 = \"Yes\", 0, K714))","v":22228.523187498333},null,{"$f":"IF(I715 = \"Yes\", M714-(C715+CostBuy)*K715, IF(J715=\"Yes\", M714+(C715-CostSell)*K714, M714+K715*Rate))","v":40011.341737497023}]
[null,1929.07,28.48,25.395,24.822499999999998,null,"Yes",null,{"$f":"IF(BuyAllowed=\"Yes\",IF(AND(G716 = \"No\", C716>D716), \"Yes\", \"No\"),\"No\")","v":"No"},{"$f":"IF(SellAllowed=\"Yes\",IF(AND(G716 = \"Yes\", C716<E716), \"Yes\", \"No\"),\"No\")","v":"No"},{"$f":"IF(I716 = \"Yes\", M715/(C716+CostBuy), IF(J716 = \"Yes\", 0, K715))","v":22228.523187498333},null,{"$f":"IF(I716 = \"Yes\", M715-(C716+CostBuy)*K716, IF(J716=\"Yes\", M715+(C716-CostSell)*K715, M715+K716*Rate))","v":41122.767896871941}]
[null,1929.08,30.1,25.998333333333331,25.5,null,"Yes",null,{"$f":"IF(BuyAllowed=\"Yes\",IF(AND(G717 = \"No\", C717>D717), \"Yes\", \"No\"),\"No\")","v":"No"},{"$f":"IF(SellAllowed=\"Yes\",IF(AND(G717 = \"Yes\", C717<E717), \"Yes\", \"No\"),\"No\")","v":"No"},{"$f":"IF(I717 = \"Yes\", M716/(C717+CostBuy), IF(J717 = \"Yes\", 0, K716))","v":22228.523187498333},null,{"$f":"IF(I717 = \"Yes\", M716-(C717+CostBuy)*K717, IF(J717=\"Yes\", M716+(C717-CostSell)*K716, M716+K717*Rate))","v":42234.194056246859}]
[null,1929.09,31.3,26.849999999999998,26.368749999999999,null,"Yes",null,{"$f":"IF(BuyAllowed=\"Yes\",IF(AND(G718 = \"No\", C718>D718), \"Yes\", \"No\"),\"No\")","v":"No"},{"$f":"IF(SellAllowed=\"Yes\",IF(AND(G718 = \"Yes\", C718<E718), \"Yes\", \"No\"),\"No\")","v":"No"},{"$f":"IF(I718 = \"Yes\", M717/(C718+CostBuy), IF(J718 = \"Yes\", 0, K717))","v":22228.523187498333},null,{"$f":"IF(I718 = \"Yes\", M717-(C718+CostBuy)*K718, IF(J718=\"Yes\", M717+(C718-CostSell)*K717, M717+K718*Rate))","v":43345.620215621777}]
[null,1929.1,27.99,27.828333333333337,27.173749999999998,null,"Yes",null,{"$f":"IF(BuyAllowed=\"Yes\",IF(AND(G719 = \"No\", C719>D719), \"Yes\", \"No\"),\"No\")","v":"No"},{"$f":"IF(SellAllowed=\"Yes\",IF(AND(G719 = \"Yes\", C719<E719), \"Yes\", \"No\"),\"No\")","v":"No"},{"$f":"IF(I719 = \"Yes\", M718/(C719+CostBuy), IF(J719 = \"Yes\", 0, K718))","v":22228.523187498333},null,{"$f":"IF(I719 = \"Yes\", M718-(C719+CostBuy)*K719, IF(J719=\"Yes\", M718+(C719-CostSell)*K718, M718+K719*Rate))","v":44457.046374996695}]
[null,1929.11,20.58,28.280000000000005,27.548750000000002,null,"Yes",null,{"$f":"IF(BuyAllowed=\"Yes\",IF(AND(G720 = \"No\", C720>D720), \"Yes\", \"No\"),\"No\")","v":"No"},{"$f":"IF(SellAllowed=\"Yes\",IF(AND(G720 = \"Yes\", C720<E720), \"Yes\", \"No\"),\"No\")","v":"Yes"},{"$f":"IF(I720 = \"Yes\", M719/(C720+CostBuy), IF(J720 = \"Yes\", 0, K719))","v":0},null,{"$f":"IF(I720 = \"Yes\", M719-(C720+CostBuy)*K720, IF(J720=\"Yes\", M719+(C720-CostSell)*K719, M719+K720*Rate))","v":500586.34218246251}]
[null,1929.12,21.4,27.433333333333326,26.942500000000003,null,"No",null,{"$f":"IF(BuyAllowed=\"Yes\",IF(AND(G721 = \"No\", C721>D721), \"Yes\", \"No\"),\"No\")","v":"No"},{"$f":"IF(SellAllowed=\"Yes\",IF(AND(G721 = \"Yes\", C721<E721), \"Yes\", \"No\"),\"No\")","v":"No"},{"$f":"IF(I721 = \"Yes\", M720/(C721+CostBuy), IF(J721 = \"Yes\", 0, K720))","v":0},null,{"$f":"IF(I721 = \"Yes\", M720-(C721+CostBuy)*K721, IF(J721=\"Yes\", M720+(C721-CostSell)*K720, M720+K721*Rate))","v":500586.34218246251}]
[null,1930.01,21.71,26.641666666666666,26.457500000000007,null,"No",null,{"$f":"IF(BuyAllowed=\"Yes\",IF(AND(G722 = \"No\", C722>D722), \"Yes\", \"No\"),\"No\")","v":"No"},{"$f":"IF(SellAllowed=\"Yes\",IF(AND(G722 = \"Yes\", C722<E722), \"Yes\", \"No\"),\"No\")","v":"No"},{"$f":"IF(I722 = \"Yes\", M721/(C722+CostBuy), IF(J722 = \"Yes\", 0, K721))","v":0},null,{"$f":"IF(I722 = \"Yes\", M721-(C722+CostBuy)*K722, IF(J722=\"Yes\", M721+(C722-CostSell)*K721, M721+K722*Rate))","v":500586.34218246251}]
[null,1930.02,23.07,25.513333333333335,25.963749999999997,null,"No",null,{"$f":"IF(BuyAllowed=\"Yes\",IF(AND(G723 = \"No\", C723>D723), \"Yes\", \"No\"),\"No\")","v":"No"},{"$f":"IF(SellAllowed=\"Yes\",IF(AND(G723 = \"Yes\", C723<E723), \"Yes\", \"No\"),\"No\")","v":"No"},{"$f":"IF(I723 = \"Yes\", M722/(C723+CostBuy), IF(J723 = \"Yes\", 0, K722))","v":0},null,{"$f":"IF(I723 = \"Yes\", M722-(C723+CostBuy)*K723, IF(J723=\"Yes\", M722+(C723-CostSell)*K722, M722+K723*Rate))","v":500586.34218246251}]
[null,1930.03,23.94,24.341666666666669,25.578749999999999,null,"No",null,{"$f":"IF(BuyAllowed=\"Yes\",IF(AND(G724 = \"No\", C724>D724), \"Yes\", \"No\"),\"No\")","v":"No"},{"$f":"IF(SellAllowed=\"Yes\",IF(AND(G724 = \"Yes\", C724<E724), \"Yes\", \"No\"),\"No\")","v":"No"},{"$f":"IF(I724 = \"Yes\", M723/(C724+CostBuy), IF(J724 = \"Yes\", 0, K723))","v":0},null,{"$f":"IF(I724 = \"Yes\", M723-(C724+CostBuy)*K724, IF(J724=\"Yes\", M723+(C724-CostSell)*K723, M723+K724*Rate))","v":500586.34218246251}]
[null,1930.04,25.46,23.114999999999998,25.01125,null,"No",null,{"$f":"IF(BuyAllowed=\"Yes\",IF(AND(G725 = \"No\", C725>D725), \"Yes\", \"No\"),\"No\")","v":"Yes"},{"$f":"IF(SellAllowed=\"Yes\",IF(AND(G725 = \"Yes\", C725<E725), \"Yes\", \"No\"),\"No\")","v":"No"},{"$f":"IF(I725 = \"Yes\", M724/(C725+CostBuy), IF(J725 = \"Yes\", 0, K724))","v":19638.538335914574},null,{"$f":"IF(I725 = \"Yes\", M724-(C725+CostBuy)*K725, IF(J725=\"Yes\", M724+(C725-CostSell)*K724, M724+K725*Rate))","v":-5.8207660913467407E-11}]
[null,1930.05,23.94,22.693333333333332,24.431250000000002,null,"Yes",null,{"$f":"IF(BuyAllowed=\"Yes\",IF(AND(G726 = \"No\", C726>D726), \"Yes\", \"No\"),\"No\")","v":"No"},{"$f":"IF(SellAllowed=\"Yes\",IF(AND(G726 = \"Yes\", C726<E726), \"Yes\", \"No\"),\"No\")","v":"Yes"},{"$f":"IF(I726 = \"Yes\", M725/(C726+CostBuy), IF(J726 = \"Yes\", 0, K725))","v":0},null,{"$f":"IF(I726 = \"Yes\", M725-(C726+CostBuy)*K726, IF(J726=\"Yes\", M725+(C726-CostSell)*K725, M725+K726*Rate))","v":468968.29546164005}]
[null,1930.06,21.52,23.253333333333334,23.51125,null,"No",null,{"$f":"IF(BuyAllowed=\"Yes\",IF(AND(G727 = \"No\", C727>D727), \"Yes\", \"No\"),\"No\")","v":"No"},{"$f":"IF(SellAllowed=\"Yes\",IF(AND(G727 = \"Yes\", C727<E727), \"Yes\", \"No\"),\"No\")","v":"No"},{"$f":"IF(I727 = \"Yes\", M726/(C727+CostBuy), IF(J727 = \"Yes\", 0, K726))","v":0},null,{"$f":"IF(I727 = \"Yes\", M726-(C727+CostBuy)*K727, IF(J727=\"Yes\", M726+(C727-CostSell)*K726, M726+K727*Rate))","v":468968.29546164005}]
[null,1930.07,21.06,23.273333333333337,22.702500000000001,null,"No",null,{"$f":"IF(BuyAllowed=\"Yes\",IF(AND(G728 = \"No\", C728>D728), \"Yes\", \"No\"),\"No\")","v":"No"},{"$f":"IF(SellAllowed=\"Yes\",IF(AND(G728 = \"Yes\", C728<E728), \"Yes\", \"No\"),\"No\")","v":"No"},{"$f":"IF(I728 = \"Yes\", M727/(C728+CostBuy), IF(J728 = \"Yes\", 0, K727))","v":0},null,{"$f":"IF(I728 = \"Yes\", M727-(C728+CostBuy)*K728, IF(J728=\"Yes\", M727+(C728-CostSell)*K727, M727+K728*Rate))","v":468968.29546164005}]
[null,1930.08,20.79,23.164999999999996,22.762500000000003,null,"No",null,{"$f":"IF(BuyAllowed=\"Yes\",IF(AND(G729 = \"No\", C729>D729), \"Yes\", \"No\"),\"No\")","v":"No"},{"$f":"IF(SellAllowed=\"Yes\",IF(AND(G729 = \"Yes\", C729<E729), \"Yes\", \"No\"),\"No\")","v":"No"},{"$f":"IF(I729 = \"Yes\", M728/(C729+CostBuy), IF(J729 = \"Yes\", 0, K728))","v":0},null,{"$f":"IF(I729 = \"Yes\", M728-(C729+CostBuy)*K729, IF(J729=\"Yes\", M728+(C729-CostSell)*K728, M728+K729*Rate))","v":468968.29546164005}]
[null,1930.09,20.78,22.785,22.686250000000001,null,"No",null,{"$f":"IF(BuyAllowed=\"Yes\",IF(AND(G730 = \"No\", C730>D730), \"Yes\", \"No\"),\"No\")","v":"No"},{"$f":"IF(SellAllowed=\"Yes\",IF(AND(G730 = \"Yes\", C730<E730), \"Yes\", \"No\"),\"No\")","v":"No"},{"$f":"IF(I730 = \"Yes\", M729/(C730+CostBuy), IF(J730 = \"Yes\", 0, K729))","v":0},null,{"$f":"IF(I730 = \"Yes\", M729-(C730+CostBuy)*K730, IF(J730=\"Yes\", M729+(C730-CostSell)*K729, M729+K730*Rate))","v":468968.29546164005}]
[null,1930.1,17.920000000000002,{"$f":"AVERAGE(C725:C730)","v":22.258333333333336},{"$f":"AVERAGE(C723:C730)","v":22.569999999999997},null,"No",null,{"$f":"IF(BuyAllowed=\"Yes\",IF(AND(G731 = \"No\", C731>D731), \"Yes\", \"No\"),\"No\")","v":"No"},{"$f":"IF(SellAllowed=\"Yes\",IF(AND(G731 = \"Yes\", C731<E731), \"Yes\", \"No\"),\"No\")","v":"No"},{"$f":"IF(I731 = \"Yes\", M730/(C731+CostBuy), IF(J731 = \"Yes\", 0, K730))","v":0},null,{"$f":"IF(I731 = \"Yes\", M730-(C731+CostBuy)*K731, IF(J731=\"Yes\", M730+(C731-CostSell)*K730, M730+K731*Rate))","v":468968.29546164005}]
[null,1930.11,16.62,21.001666666666669,21.926250000000003,null,{"$f":"IF(I731 = \"Yes\", \"Yes\", IF(J731=\"Yes\", \"No\", G731))","v":"No"},null,{"$f":"IF(BuyAllowed=\"Yes\",IF(AND(G732 = \"No\", C732>D732), \"Yes\", \"No\"),\"No\")","v":"No"},{"$f":"IF(SellAllowed=\"Yes\",IF(AND(G732 = \"Yes\", C732<E732), \"Yes\", \"No\"),\"No\")","v":"No"},{"$f":"IF(I732 = \"Yes\", M731/(C732+CostBuy), IF(J732 = \"Yes\", 0, K731))","v":0},null,{"$f":"IF(I732 = \"Yes\", M731-(C732+CostBuy)*K732, IF(J732=\"Yes\", M731+(C732-CostSell)*K731, M731+K732*Rate))","v":468968.29546164005}]
[null,1930.12,15.51,19.78166666666667,21.011250000000004,null,"No",null,{"$f":"IF(BuyAllowed=\"Yes\",IF(AND(G733 = \"No\", C733>D733), \"Yes\", \"No\"),\"No\")","v":"No"},{"$f":"IF(SellAllowed=\"Yes\",IF(AND(G733 = \"Yes\", C733<E733), \"Yes\", \"No\"),\"No\")","v":"No"},{"$f":"IF(I733 = \"Yes\", M732/(C733+CostBuy), IF(J733 = \"Yes\", 0, K732))","v":0},null,{"$f":"IF(I733 = \"Yes\", M732-(C733+CostBuy)*K733, IF(J733=\"Yes\", M732+(C733-CostSell)*K732, M732+K733*Rate))","v":468968.29546164005}]
[null,1931.01,15.98,18.78,19.767499999999998,null,"No",null,{"$f":"IF(BuyAllowed=\"Yes\",IF(AND(G734 = \"No\", C734>D734), \"Yes\", \"No\"),\"No\")","v":"No"},{"$f":"IF(SellAllowed=\"Yes\",IF(AND(G734 = \"Yes\", C734<E734), \"Yes\", \"No\"),\"No\")","v":"No"},{"$f":"IF(I734 = \"Yes\", M733/(C734+CostBuy), IF(J734 = \"Yes\", 0, K733))","v":0},null,{"$f":"IF(I734 = \"Yes\", M733-(C734+CostBuy)*K734, IF(J734=\"Yes\", M733+(C734-CostSell)*K733, M733+K734*Rate))","v":468968.29546164005}]
[null,1931.02,17.2,17.933333333333334,18.772500000000001,null,"No",null,{"$f":"IF(BuyAllowed=\"Yes\",IF(AND(G735 = \"No\", C735>D735), \"Yes\", \"No\"),\"No\")","v":"No"},{"$f":"IF(SellAllowed=\"Yes\",IF(AND(G735 = \"Yes\", C735<E735), \"Yes\", \"No\"),\"No\")","v":"No"},{"$f":"IF(I735 = \"Yes\", M734/(C735+CostBuy), IF(J735 = \"Yes\", 0, K734))","v":0},null,{"$f":"IF(I735 = \"Yes\", M734-(C735+CostBuy)*K735, IF(J735=\"Yes\", M734+(C735-CostSell)*K734, M734+K735*Rate))","v":468968.29546164005}]
[null,1931.03,17.53,17.335000000000004,18.232499999999998,null,"No",null,{"$f":"IF(BuyAllowed=\"Yes\",IF(AND(G736 = \"No\", C736>D736), \"Yes\", \"No\"),\"No\")","v":"Yes"},{"$f":"IF(SellAllowed=\"Yes\",IF(AND(G736 = \"Yes\", C736<E736), \"Yes\", \"No\"),\"No\")","v":"No"},{"$f":"IF(I736 = \"Yes\", M735/(C736+CostBuy), IF(J736 = \"Yes\", 0, K735))","v":26706.622748384965},null,{"$f":"IF(I736 = \"Yes\", M735-(C736+CostBuy)*K736, IF(J736=\"Yes\", M735+(C736-CostSell)*K735, M735+K736*Rate))","v":0}]
[null,1931.04,15.86,16.793333333333333,17.791250000000002,null,"Yes",null,{"$f":"IF(BuyAllowed=\"Yes\",IF(AND(G737 = \"No\", C737>D737), \"Yes\", \"No\"),\"No\")","v":"No"},{"$f":"IF(SellAllowed=\"Yes\",IF(AND(G737 = \"Yes\", C737<E737), \"Yes\", \"No\"),\"No\")","v":"Yes"},{"$f":"IF(I737 = \"Yes\", M736/(C737+CostBuy), IF(J737 = \"Yes\", 0, K736))","v":0},null,{"$f":"IF(I737 = \"Yes\", M736-(C737+CostBuy)*K737, IF(J737=\"Yes\", M736+(C737-CostSell)*K736, M736+K737*Rate))","v":421964.63942448242}]
[null,1931.05,14.33,16.45,17.175000000000004,null,"No",null,{"$f":"IF(BuyAllowed=\"Yes\",IF(AND(G738 = \"No\", C738>D738), \"Yes\", \"No\"),\"No\")","v":"No"},{"$f":"IF(SellAllowed=\"Yes\",IF(AND(G738 = \"Yes\", C738<E738), \"Yes\", \"No\"),\"No\")","v":"No"},{"$f":"IF(I738 = \"Yes\", M737/(C738+CostBuy), IF(J738 = \"Yes\", 0, K737))","v":0},null,{"$f":"IF(I738 = \"Yes\", M737-(C738+CostBuy)*K738, IF(J738=\"Yes\", M737+(C738-CostSell)*K737, M737+K738*Rate))","v":421964.63942448242}]
[null,1931.06,13.87,16.068333333333332,16.368750000000002,null,"No",null,{"$f":"IF(BuyAllowed=\"Yes\",IF(AND(G739 = \"No\", C739>D739), \"Yes\", \"No\"),\"No\")","v":"No"},{"$f":"IF(SellAllowed=\"Yes\",IF(AND(G739 = \"Yes\", C739<E739), \"Yes\", \"No\"),\"No\")","v":"No"},{"$f":"IF(I739 = \"Yes\", M738/(C739+CostBuy), IF(J739 = \"Yes\", 0, K738))","v":0},null,{"$f":"IF(I739 = \"Yes\", M738-(C739+CostBuy)*K739, IF(J739=\"Yes\", M738+(C739-CostSell)*K738, M738+K739*Rate))","v":421964.63942448242}]
[null,1931.07,14.33,15.795,15.862500000000001,null,"No",null,{"$f":"IF(BuyAllowed=\"Yes\",IF(AND(G740 = \"No\", C740>D740), \"Yes\", \"No\"),\"No\")","v":"No"},{"$f":"IF(SellAllowed=\"Yes\",IF(AND(G740 = \"Yes\", C740<E740), \"Yes\", \"No\"),\"No\")","v":"No"},{"$f":"IF(I740 = \"Yes\", M739/(C740+CostBuy), IF(J740 = \"Yes\", 0, K739))","v":0},null,{"$f":"IF(I740 = \"Yes\", M739-(C740+CostBuy)*K740, IF(J740=\"Yes\", M739+(C740-CostSell)*K739, M739+K740*Rate))","v":421964.63942448242}]
[null,1931.08,13.9,15.520000000000001,15.57625,null,"No",null,{"$f":"IF(BuyAllowed=\"Yes\",IF(AND(G741 = \"No\", C741>D741), \"Yes\", \"No\"),\"No\")","v":"No"},{"$f":"IF(SellAllowed=\"Yes\",IF(AND(G741 = \"Yes\", C741<E741), \"Yes\", \"No\"),\"No\")","v":"No"},{"$f":"IF(I741 = \"Yes\", M740/(C741+CostBuy), IF(J741 = \"Yes\", 0, K740))","v":0},null,{"$f":"IF(I741 = \"Yes\", M740-(C741+CostBuy)*K741, IF(J741=\"Yes\", M740+(C741-CostSell)*K740, M740+K741*Rate))","v":421964.63942448242}]
[null,1931.09,11.83,14.97,15.375,null,"No",null,{"$f":"IF(BuyAllowed=\"Yes\",IF(AND(G742 = \"No\", C742>D742), \"Yes\", \"No\"),\"No\")","v":"No"},{"$f":"IF(SellAllowed=\"Yes\",IF(AND(G742 = \"Yes\", C742<E742), \"Yes\", \"No\"),\"No\")","v":"No"},{"$f":"IF(I742 = \"Yes\", M741/(C742+CostBuy), IF(J742 = \"Yes\", 0, K741))","v":0},null,{"$f":"IF(I742 = \"Yes\", M741-(C742+CostBuy)*K742, IF(J742=\"Yes\", M741+(C742-CostSell)*K741, M741+K742*Rate))","v":421964.63942448242}]
[null,1931.1,10.25,14.019999999999998,14.856250000000001,null,"No",null,{"$f":"IF(BuyAllowed=\"Yes\",IF(AND(G743 = \"No\", C743>D743), \"Yes\", \"No\"),\"No\")","v":"No"},{"$f":"IF(SellAllowed=\"Yes\",IF(AND(G743 = \"Yes\", C743<E743), \"Yes\", \"No\"),\"No\")","v":"No"},{"$f":"IF(I743 = \"Yes\", M742/(C743+CostBuy), IF(J743 = \"Yes\", 0, K742))","v":0},null,{"$f":"IF(I743 = \"Yes\", M742-(C743+CostBuy)*K743, IF(J743=\"Yes\", M742+(C743-CostSell)*K742, M742+K743*Rate))","v":421964.63942448242}]
[null,1931.11,10.39,13.085000000000001,13.987500000000001,null,"No",null,{"$f":"IF(BuyAllowed=\"Yes\",IF(AND(G744 = \"No\", C744>D744), \"Yes\", \"No\"),\"No\")","v":"No"},{"$f":"IF(SellAllowed=\"Yes\",IF(AND(G744 = \"Yes\", C744<E744), \"Yes\", \"No\"),\"No\")","v":"No"},{"$f":"IF(I744 = \"Yes\", M743/(C744+CostBuy), IF(J744 = \"Yes\", 0, K743))","v":0},null,{"$f":"IF(I744 = \"Yes\", M743-(C744+CostBuy)*K744, IF(J744=\"Yes\", M743+(C744-CostSell)*K743, M743+K744*Rate))","v":421964.63942448242}]
[null,1931.12,8.44,12.428333333333335,13.094999999999999,null,"No",null,{"$f":"IF(BuyAllowed=\"Yes\",IF(AND(G745 = \"No\", C745>D745), \"Yes\", \"No\"),\"No\")","v":"No"},{"$f":"IF(SellAllowed=\"Yes\",IF(AND(G745 = \"Yes\", C745<E745), \"Yes\", \"No\"),\"No\")","v":"No"},{"$f":"IF(I745 = \"Yes\", M744/(C745+CostBuy), IF(J745 = \"Yes\", 0, K744))","v":0},null,{"$f":"IF(I745 = \"Yes\", M744-(C745+CostBuy)*K745, IF(J745=\"Yes\", M744+(C745-CostSell)*K744, M744+K745*Rate))","v":421964.63942448242}]
[null,1932.01,8.3000000000000007,11.523333333333333,12.1675,null,"No",null,{"$f":"IF(BuyAllowed=\"Yes\",IF(AND(G746 = \"No\", C746>D746), \"Yes\", \"No\"),\"No\")","v":"No"},{"$f":"IF(SellAllowed=\"Yes\",IF(AND(G746 = \"Yes\", C746<E746), \"Yes\", \"No\"),\"No\")","v":"No"},{"$f":"IF(I746 = \"Yes\", M745/(C746+CostBuy), IF(J746 = \"Yes\", 0, K745))","v":0},null,{"$f":"IF(I746 = \"Yes\", M745-(C746+CostBuy)*K746, IF(J746=\"Yes\", M745+(C746-CostSell)*K745, M745+K746*Rate))","v":421964.63942448242}]
[null,1932.02,8.23,10.518333333333333,11.41375,null,"No",null,{"$f":"IF(BuyAllowed=\"Yes\",IF(AND(G747 = \"No\", C747>D747), \"Yes\", \"No\"),\"No\")","v":"No"},{"$f":"IF(SellAllowed=\"Yes\",IF(AND(G747 = \"Yes\", C747<E747), \"Yes\", \"No\"),\"No\")","v":"No"},{"$f":"IF(I747 = \"Yes\", M746/(C747+CostBuy), IF(J747 = \"Yes\", 0, K746))","v":0},null,{"$f":"IF(I747 = \"Yes\", M746-(C747+CostBuy)*K747, IF(J747=\"Yes\", M746+(C747-CostSell)*K746, M746+K747*Rate))","v":421964.63942448242}]
[null,1932.03,8.26,9.5733333333333324,10.70875,null,"No",null,{"$f":"IF(BuyAllowed=\"Yes\",IF(AND(G748 = \"No\", C748>D748), \"Yes\", \"No\"),\"No\")","v":"No"},{"$f":"IF(SellAllowed=\"Yes\",IF(AND(G748 = \"Yes\", C748<E748), \"Yes\", \"No\"),\"No\")","v":"No"},{"$f":"IF(I748 = \"Yes\", M747/(C748+CostBuy), IF(J748 = \"Yes\", 0, K747))","v":0},null,{"$f":"IF(I748 = \"Yes\", M747-(C748+CostBuy)*K748, IF(J748=\"Yes\", M747+(C748-CostSell)*K747, M747+K748*Rate))","v":421964.63942448242}]
[null,1932.04,6.28,8.9783333333333335,9.9500000000000011,null,"No",null,{"$f":"IF(BuyAllowed=\"Yes\",IF(AND(G749 = \"No\", C749>D749), \"Yes\", \"No\"),\"No\")","v":"No"},{"$f":"IF(SellAllowed=\"Yes\",IF(AND(G749 = \"Yes\", C749<E749), \"Yes\", \"No\"),\"No\")","v":"No"},{"$f":"IF(I749 = \"Yes\", M748/(C749+CostBuy), IF(J749 = \"Yes\", 0, K748))","v":0},null,{"$f":"IF(I749 = \"Yes\", M748-(C749+CostBuy)*K749, IF(J749=\"Yes\", M748+(C749-CostSell)*K748, M748+K749*Rate))","v":421964.63942448242}]
[null,1932.05,5.51,8.3166666666666664,8.9975000000000005,null,"No",null,{"$f":"IF(BuyAllowed=\"Yes\",IF(AND(G750 = \"No\", C750>D750), \"Yes\", \"No\"),\"No\")","v":"No"},{"$f":"IF(SellAllowed=\"Yes\",IF(AND(G750 = \"Yes\", C750<E750), \"Yes\", \"No\"),\"No\")","v":"No"},{"$f":"IF(I750 = \"Yes\", M749/(C750+CostBuy), IF(J750 = \"Yes\", 0, K749))","v":0},null,{"$f":"IF(I750 = \"Yes\", M749-(C750+CostBuy)*K750, IF(J750=\"Yes\", M749+(C750-CostSell)*K749, M749+K750*Rate))","v":421964.63942448242}]
[null,1932.06,4.7699999999999996,7.5033333333333339,8.2074999999999996,null,"No",null,{"$f":"IF(BuyAllowed=\"Yes\",IF(AND(G751 = \"No\", C751>D751), \"Yes\", \"No\"),\"No\")","v":"No"},{"$f":"IF(SellAllowed=\"Yes\",IF(AND(G751 = \"Yes\", C751<E751), \"Yes\", \"No\"),\"No\")","v":"No"},{"$f":"IF(I751 = \"Yes\", M750/(C751+CostBuy), IF(J751 = \"Yes\", 0, K750))","v":0},null,{"$f":"IF(I751 = \"Yes\", M750-(C751+CostBuy)*K751, IF(J751=\"Yes\", M750+(C751-CostSell)*K750, M750+K751*Rate))","v":421964.63942448242}]
[null,1932.07,5.01,6.8916666666666657,7.5224999999999991,null,"No",null,{"$f":"IF(BuyAllowed=\"Yes\",IF(AND(G752 = \"No\", C752>D752), \"Yes\", \"No\"),\"No\")","v":"No"},{"$f":"IF(SellAllowed=\"Yes\",IF(AND(G752 = \"Yes\", C752<E752), \"Yes\", \"No\"),\"No\")","v":"No"},{"$f":"IF(I752 = \"Yes\", M751/(C752+CostBuy), IF(J752 = \"Yes\", 0, K751))","v":0},null,{"$f":"IF(I752 = \"Yes\", M751-(C752+CostBuy)*K752, IF(J752=\"Yes\", M751+(C752-CostSell)*K751, M751+K752*Rate))","v":421964.63942448242}]
[null,1932.08,7.53,6.3433333333333328,6.8500000000000005,null,"No",null,{"$f":"IF(BuyAllowed=\"Yes\",IF(AND(G753 = \"No\", C753>D753), \"Yes\", \"No\"),\"No\")","v":"Yes"},{"$f":"IF(SellAllowed=\"Yes\",IF(AND(G753 = \"Yes\", C753<E753), \"Yes\", \"No\"),\"No\")","v":"No"},{"$f":"IF(I753 = \"Yes\", M752/(C753+CostBuy), IF(J753 = \"Yes\", 0, K752))","v":55815.428495301901},null,{"$f":"IF(I753 = \"Yes\", M752-(C753+CostBuy)*K753, IF(J753=\"Yes\", M752+(C753-CostSell)*K752, M752+K753*Rate))","v":0}]
[null,1932.09,8.26,6.2266666666666666,6.7362499999999992,null,"Yes",null,{"$f":"IF(BuyAllowed=\"Yes\",IF(AND(G754 = \"No\", C754>D754), \"Yes\", \"No\"),\"No\")","v":"No"},{"$f":"IF(SellAllowed=\"Yes\",IF(AND(G754 = \"Yes\", C754<E754), \"Yes\", \"No\"),\"No\")","v":"No"},{"$f":"IF(I754 = \"Yes\", M753/(C754+CostBuy), IF(J754 = \"Yes\", 0, K753))","v":55815.428495301901},null,{"$f":"IF(I754 = \"Yes\", M753-(C754+CostBuy)*K754, IF(J754=\"Yes\", M753+(C754-CostSell)*K753, M753+K754*Rate))","v":2790.7714247650952}]
[null,1932.1,7.12,6.2266666666666666,6.7312499999999993,null,"Yes",null,{"$f":"IF(BuyAllowed=\"Yes\",IF(AND(G755 = \"No\", C755>D755), \"Yes\", \"No\"),\"No\")","v":"No"},{"$f":"IF(SellAllowed=\"Yes\",IF(AND(G755 = \"Yes\", C755<E755), \"Yes\", \"No\"),\"No\")","v":"No"},{"$f":"IF(I755 = \"Yes\", M754/(C755+CostBuy), IF(J755 = \"Yes\", 0, K754))","v":55815.428495301901},null,{"$f":"IF(I755 = \"Yes\", M754-(C755+CostBuy)*K755, IF(J755=\"Yes\", M754+(C755-CostSell)*K754, M754+K755*Rate))","v":5581.5428495301903}]
[null,1932.11,7.05,6.3666666666666663,6.5924999999999994,null,"Yes",null,{"$f":"IF(BuyAllowed=\"Yes\",IF(AND(G756 = \"No\", C756>D756), \"Yes\", \"No\"),\"No\")","v":"No"},{"$f":"IF(SellAllowed=\"Yes\",IF(AND(G756 = \"Yes\", C756<E756), \"Yes\", \"No\"),\"No\")","v":"No"},{"$f":"IF(I756 = \"Yes\", M755/(C756+CostBuy), IF(J756 = \"Yes\", 0, K755))","v":55815.428495301901},null,{"$f":"IF(I756 = \"Yes\", M755-(C756+CostBuy)*K756, IF(J756=\"Yes\", M755+(C756-CostSell)*K755, M755+K756*Rate))","v":8372.3142742952859}]
[null,1932.12,6.82,6.6233333333333322,6.4412499999999993,null,"Yes",null,{"$f":"IF(BuyAllowed=\"Yes\",IF(AND(G757 = \"No\", C757>D757), \"Yes\", \"No\"),\"No\")","v":"No"},{"$f":"IF(SellAllowed=\"Yes\",IF(AND(G757 = \"Yes\", C757<E757), \"Yes\", \"No\"),\"No\")","v":"No"},{"$f":"IF(I757 = \"Yes\", M756/(C757+CostBuy), IF(J757 = \"Yes\", 0, K756))","v":55815.428495301901},null,{"$f":"IF(I757 = \"Yes\", M756-(C757+CostBuy)*K757, IF(J757=\"Yes\", M756+(C757-CostSell)*K756, M756+K757*Rate))","v":11163.085699060381}]
[null,1933.01,7.09,6.9649999999999999,6.5087499999999991,null,"Yes",null,{"$f":"IF(BuyAllowed=\"Yes\",IF(AND(G758 = \"No\", C758>D758), \"Yes\", \"No\"),\"No\")","v":"No"},{"$f":"IF(SellAllowed=\"Yes\",IF(AND(G758 = \"Yes\", C758<E758), \"Yes\", \"No\"),\"No\")","v":"No"},{"$f":"IF(I758 = \"Yes\", M757/(C758+CostBuy), IF(J758 = \"Yes\", 0, K757))","v":55815.428495301901},null,{"$f":"IF(I758 = \"Yes\", M757-(C758+CostBuy)*K758, IF(J758=\"Yes\", M757+(C758-CostSell)*K757, M757+K758*Rate))","v":13953.857123825475}]
[null,1933.02,6.25,7.3116666666666674,6.7062499999999989,null,"Yes",null,{"$f":"IF(BuyAllowed=\"Yes\",IF(AND(G759 = \"No\", C759>D759), \"Yes\", \"No\"),\"No\")","v":"No"},{"$f":"IF(SellAllowed=\"Yes\",IF(AND(G759 = \"Yes\", C759<E759), \"Yes\", \"No\"),\"No\")","v":"Yes"},{"$f":"IF(I759 = \"Yes\", M758/(C759+CostBuy), IF(J759 = \"Yes\", 0, K758))","v":0},null,{"$f":"IF(I759 = \"Yes\", M758-(C759+CostBuy)*K759, IF(J759=\"Yes\", M758+(C759-CostSell)*K758, M758+K759*Rate))","v":359451.35950974427}]
[null,1933.03,6.23,7.0983333333333336,6.8912499999999994,null,"No",null,{"$f":"IF(BuyAllowed=\"Yes\",IF(AND(G760 = \"No\", C760>D760), \"Yes\", \"No\"),\"No\")","v":"No"},{"$f":"IF(SellAllowed=\"Yes\",IF(AND(G760 = \"Yes\", C760<E760), \"Yes\", \"No\"),\"No\")","v":"No"},{"$f":"IF(I760 = \"Yes\", M759/(C760+CostBuy), IF(J760 = \"Yes\", 0, K759))","v":0},null,{"$f":"IF(I760 = \"Yes\", M759-(C760+CostBuy)*K760, IF(J760=\"Yes\", M759+(C760-CostSell)*K759, M759+K760*Rate))","v":359451.35950974427}]
[null,1933.04,6.89,6.7600000000000007,7.0437500000000011,null,"No",null,{"$f":"IF(BuyAllowed=\"Yes\",IF(AND(G761 = \"No\", C761>D761), \"Yes\", \"No\"),\"No\")","v":"Yes"},{"$f":"IF(SellAllowed=\"Yes\",IF(AND(G761 = \"Yes\", C761<E761), \"Yes\", \"No\"),\"No\")","v":"No"},{"$f":"IF(I761 = \"Yes\", M760/(C761+CostBuy), IF(J761 = \"Yes\", 0, K760))","v":51943.838079442816},null,{"$f":"IF(I761 = \"Yes\", M760-(C761+CostBuy)*K761, IF(J761=\"Yes\", M760+(C761-CostSell)*K760, M760+K761*Rate))","v":0}]
[null,1933.05,8.8699999999999992,6.7216666666666667,6.963750000000001,null,"Yes",null,{"$f":"IF(BuyAllowed=\"Yes\",IF(AND(G762 = \"No\", C762>D762), \"Yes\", \"No\"),\"No\")","v":"No"},{"$f":"IF(SellAllowed=\"Yes\",IF(AND(G762 = \"Yes\", C762<E762), \"Yes\", \"No\"),\"No\")","v":"No"},{"$f":"IF(I762 = \"Yes\", M761/(C762+CostBuy), IF(J762 = \"Yes\", 0, K761))","v":51943.838079442816},null,{"$f":"IF(I762 = \"Yes\", M761-(C762+CostBuy)*K762, IF(J762=\"Yes\", M761+(C762-CostSell)*K761, M761+K762*Rate))","v":2597.1919039721411}]
[null,1933.06,10.39,7.0249999999999995,7.04,null,"Yes",null,{"$f":"IF(BuyAllowed=\"Yes\",IF(AND(G763 = \"No\", C763>D763), \"Yes\", \"No\"),\"No\")","v":"No"},{"$f":"IF(SellAllowed=\"Yes\",IF(AND(G763 = \"Yes\", C763<E763), \"Yes\", \"No\"),\"No\")","v":"No"},{"$f":"IF(I763 = \"Yes\", M762/(C763+CostBuy), IF(J763 = \"Yes\", 0, K762))","v":51943.838079442816},null,{"$f":"IF(I763 = \"Yes\", M762-(C763+CostBuy)*K763, IF(J763=\"Yes\", M762+(C763-CostSell)*K762, M762+K763*Rate))","v":5194.3838079442821}]
[null,1933.07,11.23,7.62,7.4487499999999995,null,"Yes",null,{"$f":"IF(BuyAllowed=\"Yes\",IF(AND(G764 = \"No\", C764>D764), \"Yes\", \"No\"),\"No\")","v":"No"},{"$f":"IF(SellAllowed=\"Yes\",IF(AND(G764 = \"Yes\", C764<E764), \"Yes\", \"No\"),\"No\")","v":"No"},{"$f":"IF(I764 = \"Yes\", M763/(C764+CostBuy), IF(J764 = \"Yes\", 0, K763))","v":51943.838079442816},null,{"$f":"IF(I764 = \"Yes\", M763-(C764+CostBuy)*K764, IF(J764=\"Yes\", M763+(C764-CostSell)*K763, M763+K764*Rate))","v":7791.5757119164227}]
[null,1933.08,10.67,8.31,7.9712499999999995,null,"Yes",null,{"$f":"IF(BuyAllowed=\"Yes\",IF(AND(G765 = \"No\", C765>D765), \"Yes\", \"No\"),\"No\")","v":"No"},{"$f":"IF(SellAllowed=\"Yes\",IF(AND(G765 = \"Yes\", C765<E765), \"Yes\", \"No\"),\"No\")","v":"No"},{"$f":"IF(I765 = \"Yes\", M764/(C765+CostBuy), IF(J765 = \"Yes\", 0, K764))","v":51943.838079442816},null,{"$f":"IF(I765 = \"Yes\", M764-(C765+CostBuy)*K765, IF(J765=\"Yes\", M764+(C765-CostSell)*K764, M764+K765*Rate))","v":10388.767615888564}]
[null,1933.09,10.58,9.0466666666666669,8.4525000000000006,null,"Yes",null,{"$f":"IF(BuyAllowed=\"Yes\",IF(AND(G766 = \"No\", C766>D766), \"Yes\", \"No\"),\"No\")","v":"No"},{"$f":"IF(SellAllowed=\"Yes\",IF(AND(G766 = \"Yes\", C766<E766), \"Yes\", \"No\"),\"No\")","v":"No"},{"$f":"IF(I766 = \"Yes\", M765/(C766+CostBuy), IF(J766 = \"Yes\", 0, K765))","v":51943.838079442816},null,{"$f":"IF(I766 = \"Yes\", M765-(C766+CostBuy)*K766, IF(J766=\"Yes\", M765+(C766-CostSell)*K765, M765+K766*Rate))","v":12985.959519860706}]
[null,1933.1,9.5500000000000007,9.7716666666666665,8.8887499999999999,null,"Yes",null,{"$f":"IF(BuyAllowed=\"Yes\",IF(AND(G767 = \"No\", C767>D767), \"Yes\", \"No\"),\"No\")","v":"No"},{"$f":"IF(SellAllowed=\"Yes\",IF(AND(G767 = \"Yes\", C767<E767), \"Yes\", \"No\"),\"No\")","v":"No"},{"$f":"IF(I767 = \"Yes\", M766/(C767+CostBuy), IF(J767 = \"Yes\", 0, K766))","v":51943.838079442816},null,{"$f":"IF(I767 = \"Yes\", M766-(C767+CostBuy)*K767, IF(J767=\"Yes\", M766+(C767-CostSell)*K766, M766+K767*Rate))","v":15583.151423832847}]
[null,1933.11,9.7799999999999994,10.214999999999998,9.3012499999999996,null,"Yes",null,{"$f":"IF(BuyAllowed=\"Yes\",IF(AND(G768 = \"No\", C768>D768), \"Yes\", \"No\"),\"No\")","v":"No"},{"$f":"IF(SellAllowed=\"Yes\",IF(AND(G768 = \"Yes\", C768<E768), \"Yes\", \"No\"),\"No\")","v":"No"},{"$f":"IF(I768 = \"Yes\", M767/(C768+CostBuy), IF(J768 = \"Yes\", 0, K767))","v":51943.838079442816},null,{"$f":"IF(I768 = \"Yes\", M767-(C768+CostBuy)*K768, IF(J768=\"Yes\", M767+(C768-CostSell)*K767, M767+K768*Rate))","v":18180.343327804989}]
[null,1933.12,9.9700000000000006,10.366666666666667,9.7449999999999992,null,"Yes",null,{"$f":"IF(BuyAllowed=\"Yes\",IF(AND(G769 = \"No\", C769>D769), \"Yes\", \"No\"),\"No\")","v":"No"},{"$f":"IF(SellAllowed=\"Yes\",IF(AND(G769 = \"Yes\", C769<E769), \"Yes\", \"No\"),\"No\")","v":"No"},{"$f":"IF(I769 = \"Yes\", M768/(C769+CostBuy), IF(J769 = \"Yes\", 0, K768))","v":51943.838079442816},null,{"$f":"IF(I769 = \"Yes\", M768-(C769+CostBuy)*K769, IF(J769=\"Yes\", M768+(C769-CostSell)*K768, M768+K769*Rate))","v":20777.535231777129}]
[null,1934.01,10.54,10.296666666666667,10.129999999999999,null,"Yes",null,{"$f":"IF(BuyAllowed=\"Yes\",IF(AND(G770 = \"No\", C770>D770), \"Yes\", \"No\"),\"No\")","v":"No"},{"$f":"IF(SellAllowed=\"Yes\",IF(AND(G770 = \"Yes\", C770<E770), \"Yes\", \"No\"),\"No\")","v":"No"},{"$f":"IF(I770 = \"Yes\", M769/(C770+CostBuy), IF(J770 = \"Yes\", 0, K769))","v":51943.838079442816},null,{"$f":"IF(I770 = \"Yes\", M769-(C770+CostBuy)*K770, IF(J770=\"Yes\", M769+(C770-CostSell)*K769, M769+K770*Rate))","v":23374.727135749268}]
[null,1934.02,11.32,10.181666666666667,10.338750000000001,null,"Yes",null,{"$f":"IF(BuyAllowed=\"Yes\",IF(AND(G771 = \"No\", C771>D771), \"Yes\", \"No\"),\"No\")","v":"No"},{"$f":"IF(SellAllowed=\"Yes\",IF(AND(G771 = \"Yes\", C771<E771), \"Yes\", \"No\"),\"No\")","v":"No"},{"$f":"IF(I771 = \"Yes\", M770/(C771+CostBuy), IF(J771 = \"Yes\", 0, K770))","v":51943.838079442816},null,{"$f":"IF(I771 = \"Yes\", M770-(C771+CostBuy)*K771, IF(J771=\"Yes\", M770+(C771-CostSell)*K770, M770+K771*Rate))","v":25971.919039721408}]
[null,1934.03,10.74,10.290000000000001,10.454999999999998,null,"Yes",null,{"$f":"IF(BuyAllowed=\"Yes\",IF(AND(G772 = \"No\", C772>D772), \"Yes\", \"No\"),\"No\")","v":"No"},{"$f":"IF(SellAllowed=\"Yes\",IF(AND(G772 = \"Yes\", C772<E772), \"Yes\", \"No\"),\"No\")","v":"No"},{"$f":"IF(I772 = \"Yes\", M771/(C772+CostBuy), IF(J772 = \"Yes\", 0, K771))","v":51943.838079442816},null,{"$f":"IF(I772 = \"Yes\", M771-(C772+CostBuy)*K772, IF(J772=\"Yes\", M771+(C772-CostSell)*K771, M771+K772*Rate))","v":28569.110943693548}]
[null,1934.04,10.92,10.316666666666666,10.393749999999999,null,"Yes",null,{"$f":"IF(BuyAllowed=\"Yes\",IF(AND(G773 = \"No\", C773>D773), \"Yes\", \"No\"),\"No\")","v":"No"},{"$f":"IF(SellAllowed=\"Yes\",IF(AND(G773 = \"Yes\", C773<E773), \"Yes\", \"No\"),\"No\")","v":"No"},{"$f":"IF(I773 = \"Yes\", M772/(C773+CostBuy), IF(J773 = \"Yes\", 0, K772))","v":51943.838079442816},null,{"$f":"IF(I773 = \"Yes\", M772-(C773+CostBuy)*K773, IF(J773=\"Yes\", M772+(C773-CostSell)*K772, M772+K773*Rate))","v":31166.302847665687}]
[null,1934.05,9.81,10.545,10.425000000000001,null,"Yes",null,{"$f":"IF(BuyAllowed=\"Yes\",IF(AND(G774 = \"No\", C774>D774), \"Yes\", \"No\"),\"No\")","v":"No"},{"$f":"IF(SellAllowed=\"Yes\",IF(AND(G774 = \"Yes\", C774<E774), \"Yes\", \"No\"),\"No\")","v":"Yes"},{"$f":"IF(I774 = \"Yes\", M773/(C774+CostBuy), IF(J774 = \"Yes\", 0, K773))","v":0},null,{"$f":"IF(I774 = \"Yes\", M773-(C774+CostBuy)*K774, IF(J774=\"Yes\", M773+(C774-CostSell)*K773, M773+K774*Rate))","v":537618.72412223311}]
[null,1934.06,9.94,10.55,10.328749999999999,null,"No",null,{"$f":"IF(BuyAllowed=\"Yes\",IF(AND(G775 = \"No\", C775>D775), \"Yes\", \"No\"),\"No\")","v":"No"},{"$f":"IF(SellAllowed=\"Yes\",IF(AND(G775 = \"Yes\", C775<E775), \"Yes\", \"No\"),\"No\")","v":"No"},{"$f":"IF(I775 = \"Yes\", M774/(C775+CostBuy), IF(J775 = \"Yes\", 0, K774))","v":0},null,{"$f":"IF(I775 = \"Yes\", M774-(C775+CostBuy)*K775, IF(J775=\"Yes\", M774+(C775-CostSell)*K774, M774+K775*Rate))","v":537618.72412223311}]
[null,1934.07,9.4700000000000006,10.545,10.3775,null,"No",null,{"$f":"IF(BuyAllowed=\"Yes\",IF(AND(G776 = \"No\", C776>D776), \"Yes\", \"No\"),\"No\")","v":"No"},{"$f":"IF(SellAllowed=\"Yes\",IF(AND(G776 = \"Yes\", C776<E776), \"Yes\", \"No\"),\"No\")","v":"No"},{"$f":"IF(I776 = \"Yes\", M775/(C776+CostBuy), IF(J776 = \"Yes\", 0, K775))","v":0},null,{"$f":"IF(I776 = \"Yes\", M775-(C776+CostBuy)*K776, IF(J776=\"Yes\", M775+(C776-CostSell)*K775, M775+K776*Rate))","v":537618.72412223311}]
[null,1934.08,9.1,10.366666666666667,10.338750000000001,null,"No",null,{"$f":"IF(BuyAllowed=\"Yes\",IF(AND(G777 = \"No\", C777>D777), \"Yes\", \"No\"),\"No\")","v":"No"},{"$f":"IF(SellAllowed=\"Yes\",IF(AND(G777 = \"Yes\", C777<E777), \"Yes\", \"No\"),\"No\")","v":"No"},{"$f":"IF(I777 = \"Yes\", M776/(C777+CostBuy), IF(J777 = \"Yes\", 0, K776))","v":0},null,{"$f":"IF(I777 = \"Yes\", M776-(C777+CostBuy)*K777, IF(J777=\"Yes\", M776+(C777-CostSell)*K776, M776+K777*Rate))","v":537618.72412223311}]
[null,1934.09,8.8800000000000008,9.9966666666666661,10.23,null,"No",null,{"$f":"IF(BuyAllowed=\"Yes\",IF(AND(G778 = \"No\", C778>D778), \"Yes\", \"No\"),\"No\")","v":"No"},{"$f":"IF(SellAllowed=\"Yes\",IF(AND(G778 = \"Yes\", C778<E778), \"Yes\", \"No\"),\"No\")","v":"No"},{"$f":"IF(I778 = \"Yes\", M777/(C778+CostBuy), IF(J778 = \"Yes\", 0, K777))","v":0},null,{"$f":"IF(I778 = \"Yes\", M777-(C778+CostBuy)*K778, IF(J778=\"Yes\", M777+(C778-CostSell)*K777, M777+K778*Rate))","v":537618.72412223311}]
[null,1934.1,8.9499999999999993,9.6866666666666674,10.022499999999999,null,"No",null,{"$f":"IF(BuyAllowed=\"Yes\",IF(AND(G779 = \"No\", C779>D779), \"Yes\", \"No\"),\"No\")","v":"No"},{"$f":"IF(SellAllowed=\"Yes\",IF(AND(G779 = \"Yes\", C779<E779), \"Yes\", \"No\"),\"No\")","v":"No"},{"$f":"IF(I779 = \"Yes\", M778/(C779+CostBuy), IF(J779 = \"Yes\", 0, K778))","v":0},null,{"$f":"IF(I779 = \"Yes\", M778-(C779+CostBuy)*K779, IF(J779=\"Yes\", M778+(C779-CostSell)*K778, M778+K779*Rate))","v":537618.72412223311}]
[null,1934.11,9.1999999999999993,9.3583333333333343,9.7262500000000003,null,"No",null,{"$f":"IF(BuyAllowed=\"Yes\",IF(AND(G780 = \"No\", C780>D780), \"Yes\", \"No\"),\"No\")","v":"No"},{"$f":"IF(SellAllowed=\"Yes\",IF(AND(G780 = \"Yes\", C780<E780), \"Yes\", \"No\"),\"No\")","v":"No"},{"$f":"IF(I780 = \"Yes\", M779/(C780+CostBuy), IF(J780 = \"Yes\", 0, K779))","v":0},null,{"$f":"IF(I780 = \"Yes\", M779-(C780+CostBuy)*K780, IF(J780=\"Yes\", M779+(C780-CostSell)*K779, M779+K780*Rate))","v":537618.72412223311}]
[null,1934.12,9.26,9.2566666666666677,9.5337500000000013,null,"No",null,{"$f":"IF(BuyAllowed=\"Yes\",IF(AND(G781 = \"No\", C781>D781), \"Yes\", \"No\"),\"No\")","v":"Yes"},{"$f":"IF(SellAllowed=\"Yes\",IF(AND(G781 = \"Yes\", C781<E781), \"Yes\", \"No\"),\"No\")","v":"No"},{"$f":"IF(I781 = \"Yes\", M780/(C781+CostBuy), IF(J781 = \"Yes\", 0, K780))","v":57870.691509390002},null,{"$f":"IF(I781 = \"Yes\", M780-(C781+CostBuy)*K781, IF(J781=\"Yes\", M780+(C781-CostSell)*K780, M780+K781*Rate))","v":0}]
[null,1935.01,9.26,9.1433333333333344,9.3262500000000017,null,"Yes",null,{"$f":"IF(BuyAllowed=\"Yes\",IF(AND(G782 = \"No\", C782>D782), \"Yes\", \"No\"),\"No\")","v":"No"},{"$f":"IF(SellAllowed=\"Yes\",IF(AND(G782 = \"Yes\", C782<E782), \"Yes\", \"No\"),\"No\")","v":"Yes"},{"$f":"IF(I782 = \"Yes\", M781/(C782+CostBuy), IF(J782 = \"Yes\", 0, K781))","v":0},null,{"$f":"IF(I782 = \"Yes\", M781-(C782+CostBuy)*K782, IF(J782=\"Yes\", M781+(C782-CostSell)*K781, M781+K782*Rate))","v":532410.36188638792}]
[null,1935.02,8.98,9.1083333333333325,9.2575000000000021,null,"No",null,{"$f":"IF(BuyAllowed=\"Yes\",IF(AND(G783 = \"No\", C783>D783), \"Yes\", \"No\"),\"No\")","v":"No"},{"$f":"IF(SellAllowed=\"Yes\",IF(AND(G783 = \"Yes\", C783<E783), \"Yes\", \"No\"),\"No\")","v":"No"},{"$f":"IF(I783 = \"Yes\", M782/(C783+CostBuy), IF(J783 = \"Yes\", 0, K782))","v":0},null,{"$f":"IF(I783 = \"Yes\", M782-(C783+CostBuy)*K783, IF(J783=\"Yes\", M782+(C783-CostSell)*K782, M782+K783*Rate))","v":532410.36188638792}]
[null,1935.03,8.41,9.0883333333333329,9.1375000000000011,null,"No",null,{"$f":"IF(BuyAllowed=\"Yes\",IF(AND(G784 = \"No\", C784>D784), \"Yes\", \"No\"),\"No\")","v":"No"},{"$f":"IF(SellAllowed=\"Yes\",IF(AND(G784 = \"Yes\", C784<E784), \"Yes\", \"No\"),\"No\")","v":"No"},{"$f":"IF(I784 = \"Yes\", M783/(C784+CostBuy), IF(J784 = \"Yes\", 0, K783))","v":0},null,{"$f":"IF(I784 = \"Yes\", M783-(C784+CostBuy)*K784, IF(J784=\"Yes\", M783+(C784-CostSell)*K783, M783+K784*Rate))","v":532410.36188638792}]
[null,1935.04,9.0399999999999991,9.009999999999998,9.004999999999999,null,"No",null,{"$f":"IF(BuyAllowed=\"Yes\",IF(AND(G785 = \"No\", C785>D785), \"Yes\", \"No\"),\"No\")","v":"Yes"},{"$f":"IF(SellAllowed=\"Yes\",IF(AND(G785 = \"Yes\", C785<E785), \"Yes\", \"No\"),\"No\")","v":"No"},{"$f":"IF(I785 = \"Yes\", M784/(C785+CostBuy), IF(J785 = \"Yes\", 0, K784))","v":58700.150152854243},null,{"$f":"IF(I785 = \"Yes\", M784-(C785+CostBuy)*K785, IF(J785=\"Yes\", M784+(C785-CostSell)*K784, M784+K785*Rate))","v":0}]
[null,1935.05,9.75,9.0250000000000004,8.9974999999999987,null,"Yes",null,{"$f":"IF(BuyAllowed=\"Yes\",IF(AND(G786 = \"No\", C786>D786), \"Yes\", \"No\"),\"No\")","v":"No"},{"$f":"IF(SellAllowed=\"Yes\",IF(AND(G786 = \"Yes\", C786<E786), \"Yes\", \"No\"),\"No\")","v":"No"},{"$f":"IF(I786 = \"Yes\", M785/(C786+CostBuy), IF(J786 = \"Yes\", 0, K785))","v":58700.150152854243},null,{"$f":"IF(I786 = \"Yes\", M785-(C786+CostBuy)*K786, IF(J786=\"Yes\", M785+(C786-CostSell)*K785, M785+K786*Rate))","v":2935.0075076427124}]
[null,1935.06,10.119999999999999,9.1166666666666654,9.1062499999999993,null,"Yes",null,{"$f":"IF(BuyAllowed=\"Yes\",IF(AND(G787 = \"No\", C787>D787), \"Yes\", \"No\"),\"No\")","v":"No"},{"$f":"IF(SellAllowed=\"Yes\",IF(AND(G787 = \"Yes\", C787<E787), \"Yes\", \"No\"),\"No\")","v":"No"},{"$f":"IF(I787 = \"Yes\", M786/(C787+CostBuy), IF(J787 = \"Yes\", 0, K786))","v":58700.150152854243},null,{"$f":"IF(I787 = \"Yes\", M786-(C787+CostBuy)*K787, IF(J787=\"Yes\", M786+(C787-CostSell)*K786, M786+K787*Rate))","v":5870.0150152854249}]
[null,1935.07,10.65,9.26,9.2524999999999995,null,"Yes",null,{"$f":"IF(BuyAllowed=\"Yes\",IF(AND(G788 = \"No\", C788>D788), \"Yes\", \"No\"),\"No\")","v":"No"},{"$f":"IF(SellAllowed=\"Yes\",IF(AND(G788 = \"Yes\", C788<E788), \"Yes\", \"No\"),\"No\")","v":"No"},{"$f":"IF(I788 = \"Yes\", M787/(C788+CostBuy), IF(J788 = \"Yes\", 0, K787))","v":58700.150152854243},null,{"$f":"IF(I788 = \"Yes\", M787-(C788+CostBuy)*K788, IF(J788=\"Yes\", M787+(C788-CostSell)*K787, M787+K788*Rate))","v":8805.0225229281368}]
[null,1935.08,11.37,9.4916666666666654,9.4337499999999999,null,"Yes",null,{"$f":"IF(BuyAllowed=\"Yes\",IF(AND(G789 = \"No\", C789>D789), \"Yes\", \"No\"),\"No\")","v":"No"},{"$f":"IF(SellAllowed=\"Yes\",IF(AND(G789 = \"Yes\", C789<E789), \"Yes\", \"No\"),\"No\")","v":"No"},{"$f":"IF(I789 = \"Yes\", M788/(C789+CostBuy), IF(J789 = \"Yes\", 0, K788))","v":58700.150152854243},null,{"$f":"IF(I789 = \"Yes\", M788-(C789+CostBuy)*K789, IF(J789=\"Yes\", M788+(C789-CostSell)*K788, M788+K789*Rate))","v":11740.03003057085}]
[null,1935.09,11.61,9.8899999999999988,9.6974999999999998,null,"Yes",null,{"$f":"IF(BuyAllowed=\"Yes\",IF(AND(G790 = \"No\", C790>D790), \"Yes\", \"No\"),\"No\")","v":"No"},{"$f":"IF(SellAllowed=\"Yes\",IF(AND(G790 = \"Yes\", C790<E790), \"Yes\", \"No\"),\"No\")","v":"No"},{"$f":"IF(I790 = \"Yes\", M789/(C790+CostBuy), IF(J790 = \"Yes\", 0, K789))","v":58700.150152854243},null,{"$f":"IF(I790 = \"Yes\", M789-(C790+CostBuy)*K790, IF(J790=\"Yes\", M789+(C790-CostSell)*K789, M789+K790*Rate))","v":14675.037538213563}]
[null,1935.1,11.92,10.423333333333332,9.9912499999999991,null,"Yes",null,{"$f":"IF(BuyAllowed=\"Yes\",IF(AND(G791 = \"No\", C791>D791), \"Yes\", \"No\"),\"No\")","v":"No"},{"$f":"IF(SellAllowed=\"Yes\",IF(AND(G791 = \"Yes\", C791<E791), \"Yes\", \"No\"),\"No\")","v":"No"},{"$f":"IF(I791 = \"Yes\", M790/(C791+CostBuy), IF(J791 = \"Yes\", 0, K790))","v":58700.150152854243},null,{"$f":"IF(I791 = \"Yes\", M790-(C791+CostBuy)*K791, IF(J791=\"Yes\", M790+(C791-CostSell)*K790, M790+K791*Rate))","v":17610.045045856274}]
[null,1935.11,13.04,10.903333333333331,10.358749999999999,null,"Yes",null,{"$f":"IF(BuyAllowed=\"Yes\",IF(AND(G792 = \"No\", C792>D792), \"Yes\", \"No\"),\"No\")","v":"No"},{"$f":"IF(SellAllowed=\"Yes\",IF(AND(G792 = \"Yes\", C792<E792), \"Yes\", \"No\"),\"No\")","v":"No"},{"$f":"IF(I792 = \"Yes\", M791/(C792+CostBuy), IF(J792 = \"Yes\", 0, K791))","v":58700.150152854243},null,{"$f":"IF(I792 = \"Yes\", M791-(C792+CostBuy)*K792, IF(J792=\"Yes\", M791+(C792-CostSell)*K791, M791+K792*Rate))","v":20545.052553498987}]
[null,1935.12,13.04,11.451666666666668,10.9375,null,"Yes",null,{"$f":"IF(BuyAllowed=\"Yes\",IF(AND(G793 = \"No\", C793>D793), \"Yes\", \"No\"),\"No\")","v":"No"},{"$f":"IF(SellAllowed=\"Yes\",IF(AND(G793 = \"Yes\", C793<E793), \"Yes\", \"No\"),\"No\")","v":"No"},{"$f":"IF(I793 = \"Yes\", M792/(C793+CostBuy), IF(J793 = \"Yes\", 0, K792))","v":58700.150152854243},null,{"$f":"IF(I793 = \"Yes\", M792-(C793+CostBuy)*K793, IF(J793=\"Yes\", M792+(C793-CostSell)*K792, M792+K793*Rate))","v":23480.060061141699}]
[null,1936.01,13.76,11.938333333333333,11.437499999999996,null,"Yes",null,{"$f":"IF(BuyAllowed=\"Yes\",IF(AND(G794 = \"No\", C794>D794), \"Yes\", \"No\"),\"No\")","v":"No"},{"$f":"IF(SellAllowed=\"Yes\",IF(AND(G794 = \"Yes\", C794<E794), \"Yes\", \"No\"),\"No\")","v":"No"},{"$f":"IF(I794 = \"Yes\", M793/(C794+CostBuy), IF(J794 = \"Yes\", 0, K793))","v":58700.150152854243},null,{"$f":"IF(I794 = \"Yes\", M793-(C794+CostBuy)*K794, IF(J794=\"Yes\", M793+(C794-CostSell)*K793, M793+K794*Rate))","v":26415.067568784412}]
[null,1936.02,14.55,{"$f":"AVERAGE(C789:C794)","v":12.456666666666665},{"$f":"AVERAGE(C787:C794)","v":11.938750000000001},null,"Yes",null,{"$f":"IF(BuyAllowed=\"Yes\",IF(AND(G795 = \"No\", C795>D795), \"Yes\", \"No\"),\"No\")","v":"No"},{"$f":"IF(SellAllowed=\"Yes\",IF(AND(G795 = \"Yes\", C795<E795), \"Yes\", \"No\"),\"No\")","v":"No"},{"$f":"IF(I795 = \"Yes\", M794/(C795+CostBuy), IF(J795 = \"Yes\", 0, K794))","v":58700.150152854243},null,{"$f":"IF(I795 = \"Yes\", M794-(C795+CostBuy)*K795, IF(J795=\"Yes\", M794+(C795-CostSell)*K794, M794+K795*Rate))","v":29350.075076427125}]
[null,1936.03,14.86,12.986666666666666,12.4925,null,{"$f":"IF(I795 = \"Yes\", \"Yes\", IF(J795=\"Yes\", \"No\", G795))","v":"Yes"},null,{"$f":"IF(BuyAllowed=\"Yes\",IF(AND(G796 = \"No\", C796>D796), \"Yes\", \"No\"),\"No\")","v":"No"},{"$f":"IF(SellAllowed=\"Yes\",IF(AND(G796 = \"Yes\", C796<E796), \"Yes\", \"No\"),\"No\")","v":"No"},{"$f":"IF(I796 = \"Yes\", M795/(C796+CostBuy), IF(J796 = \"Yes\", 0, K795))","v":58700.150152854243},null,{"$f":"IF(I796 = \"Yes\", M795-(C796+CostBuy)*K796, IF(J796=\"Yes\", M795+(C796-CostSell)*K795, M795+K796*Rate))","v":32285.082584069838}]
[null,1936.04,14.88,13.528333333333334,13.018749999999999,null,"Yes",null,{"$f":"IF(BuyAllowed=\"Yes\",IF(AND(G797 = \"No\", C797>D797), \"Yes\", \"No\"),\"No\")","v":"No"},{"$f":"IF(SellAllowed=\"Yes\",IF(AND(G797 = \"Yes\", C797<E797), \"Yes\", \"No\"),\"No\")","v":"No"},{"$f":"IF(I797 = \"Yes\", M796/(C797+CostBuy), IF(J797 = \"Yes\", 0, K796))","v":58700.150152854243},null,{"$f":"IF(I797 = \"Yes\", M796-(C797+CostBuy)*K797, IF(J797=\"Yes\", M796+(C797-CostSell)*K796, M796+K797*Rate))","v":35220.090091712547}]
[null,1936.05,14.09,14.021666666666667,13.4575,null,"Yes",null,{"$f":"IF(BuyAllowed=\"Yes\",IF(AND(G798 = \"No\", C798>D798), \"Yes\", \"No\"),\"No\")","v":"No"},{"$f":"IF(SellAllowed=\"Yes\",IF(AND(G798 = \"Yes\", C798<E798), \"Yes\", \"No\"),\"No\")","v":"No"},{"$f":"IF(I798 = \"Yes\", M797/(C798+CostBuy), IF(J798 = \"Yes\", 0, K797))","v":58700.150152854243},null,{"$f":"IF(I798 = \"Yes\", M797-(C798+CostBuy)*K798, IF(J798=\"Yes\", M797+(C798-CostSell)*K797, M797+K798*Rate))","v":38155.097599355257}]
[null,1936.06,14.69,14.196666666666665,13.7675,null,"Yes",null,{"$f":"IF(BuyAllowed=\"Yes\",IF(AND(G799 = \"No\", C799>D799), \"Yes\", \"No\"),\"No\")","v":"No"},{"$f":"IF(SellAllowed=\"Yes\",IF(AND(G799 = \"Yes\", C799<E799), \"Yes\", \"No\"),\"No\")","v":"No"},{"$f":"IF(I799 = \"Yes\", M798/(C799+CostBuy), IF(J799 = \"Yes\", 0, K798))","v":58700.150152854243},null,{"$f":"IF(I799 = \"Yes\", M798-(C799+CostBuy)*K799, IF(J799=\"Yes\", M798+(C799-CostSell)*K798, M798+K799*Rate))","v":41090.105106997966}]
[null,1936.07,15.56,14.471666666666666,14.11375,null,"Yes",null,{"$f":"IF(BuyAllowed=\"Yes\",IF(AND(G800 = \"No\", C800>D800), \"Yes\", \"No\"),\"No\")","v":"No"},{"$f":"IF(SellAllowed=\"Yes\",IF(AND(G800 = \"Yes\", C800<E800), \"Yes\", \"No\"),\"No\")","v":"No"},{"$f":"IF(I800 = \"Yes\", M799/(C800+CostBuy), IF(J800 = \"Yes\", 0, K799))","v":58700.150152854243},null,{"$f":"IF(I800 = \"Yes\", M799-(C800+CostBuy)*K800, IF(J800=\"Yes\", M799+(C800-CostSell)*K799, M799+K800*Rate))","v":44025.112614640675}]
[null,1936.08,15.87,14.771666666666667,14.428749999999999,null,"Yes",null,{"$f":"IF(BuyAllowed=\"Yes\",IF(AND(G801 = \"No\", C801>D801), \"Yes\", \"No\"),\"No\")","v":"No"},{"$f":"IF(SellAllowed=\"Yes\",IF(AND(G801 = \"Yes\", C801<E801), \"Yes\", \"No\"),\"No\")","v":"No"},{"$f":"IF(I801 = \"Yes\", M800/(C801+CostBuy), IF(J801 = \"Yes\", 0, K800))","v":58700.150152854243},null,{"$f":"IF(I801 = \"Yes\", M800-(C801+CostBuy)*K801, IF(J801=\"Yes\", M800+(C801-CostSell)*K800, M800+K801*Rate))","v":46960.120122283384}]
[null,1936.09,16.05,14.991666666666667,14.782500000000001,null,"Yes",null,{"$f":"IF(BuyAllowed=\"Yes\",IF(AND(G802 = \"No\", C802>D802), \"Yes\", \"No\"),\"No\")","v":"No"},{"$f":"IF(SellAllowed=\"Yes\",IF(AND(G802 = \"Yes\", C802<E802), \"Yes\", \"No\"),\"No\")","v":"No"},{"$f":"IF(I802 = \"Yes\", M801/(C802+CostBuy), IF(J802 = \"Yes\", 0, K801))","v":58700.150152854243},null,{"$f":"IF(I802 = \"Yes\", M801-(C802+CostBuy)*K802, IF(J802=\"Yes\", M801+(C802-CostSell)*K801, M801+K802*Rate))","v":49895.127629926094}]
[null,1936.1,16.89,15.19,15.06875,null,"Yes",null,{"$f":"IF(BuyAllowed=\"Yes\",IF(AND(G803 = \"No\", C803>D803), \"Yes\", \"No\"),\"No\")","v":"No"},{"$f":"IF(SellAllowed=\"Yes\",IF(AND(G803 = \"Yes\", C803<E803), \"Yes\", \"No\"),\"No\")","v":"No"},{"$f":"IF(I803 = \"Yes\", M802/(C803+CostBuy), IF(J803 = \"Yes\", 0, K802))","v":58700.150152854243},null,{"$f":"IF(I803 = \"Yes\", M802-(C803+CostBuy)*K803, IF(J803=\"Yes\", M802+(C803-CostSell)*K802, M802+K803*Rate))","v":52830.135137568803}]
[null,1936.11,17.36,15.525,15.36125,null,"Yes",null,{"$f":"IF(BuyAllowed=\"Yes\",IF(AND(G804 = \"No\", C804>D804), \"Yes\", \"No\"),\"No\")","v":"No"},{"$f":"IF(SellAllowed=\"Yes\",IF(AND(G804 = \"Yes\", C804<E804), \"Yes\", \"No\"),\"No\")","v":"No"},{"$f":"IF(I804 = \"Yes\", M803/(C804+CostBuy), IF(J804 = \"Yes\", 0, K803))","v":58700.150152854243},null,{"$f":"IF(I804 = \"Yes\", M803-(C804+CostBuy)*K804, IF(J804=\"Yes\", M803+(C804-CostSell)*K803, M803+K804*Rate))","v":55765.142645211512}]
[null,1936.12,17.059999999999999,16.07,15.67375,null,"Yes",null,{"$f":"IF(BuyAllowed=\"Yes\",IF(AND(G805 = \"No\", C805>D805), \"Yes\", \"No\"),\"No\")","v":"No"},{"$f":"IF(SellAllowed=\"Yes\",IF(AND(G805 = \"Yes\", C805<E805), \"Yes\", \"No\"),\"No\")","v":"No"},{"$f":"IF(I805 = \"Yes\", M804/(C805+CostBuy), IF(J805 = \"Yes\", 0, K804))","v":58700.150152854243},null,{"$f":"IF(I805 = \"Yes\", M804-(C805+CostBuy)*K805, IF(J805=\"Yes\", M804+(C805-CostSell)*K804, M804+K805*Rate))","v":58700.150152854221}]
[null,1937.01,17.59,16.465,15.946250000000001,null,"Yes",null,{"$f":"IF(BuyAllowed=\"Yes\",IF(AND(G806 = \"No\", C806>D806), \"Yes\", \"No\"),\"No\")","v":"No"},{"$f":"IF(SellAllowed=\"Yes\",IF(AND(G806 = \"Yes\", C806<E806), \"Yes\", \"No\"),\"No\")","v":"No"},{"$f":"IF(I806 = \"Yes\", M805/(C806+CostBuy), IF(J806 = \"Yes\", 0, K805))","v":58700.150152854243},null,{"$f":"IF(I806 = \"Yes\", M805-(C806+CostBuy)*K806, IF(J806=\"Yes\", M805+(C806-CostSell)*K805, M805+K806*Rate))","v":61635.15766049693}]
[null,1937.02,18.11,16.803333333333335,16.383749999999999,null,"Yes",null,{"$f":"IF(BuyAllowed=\"Yes\",IF(AND(G807 = \"No\", C807>D807), \"Yes\", \"No\"),\"No\")","v":"No"},{"$f":"IF(SellAllowed=\"Yes\",IF(AND(G807 = \"Yes\", C807<E807), \"Yes\", \"No\"),\"No\")","v":"No"},{"$f":"IF(I807 = \"Yes\", M806/(C807+CostBuy), IF(J807 = \"Yes\", 0, K806))","v":58700.150152854243},null,{"$f":"IF(I807 = \"Yes\", M806-(C807+CostBuy)*K807, IF(J807=\"Yes\", M806+(C807-CostSell)*K806, M806+K807*Rate))","v":64570.16516813964}]
[null,1937.03,18.09,17.176666666666666,16.811250000000001,null,"Yes",null,{"$f":"IF(BuyAllowed=\"Yes\",IF(AND(G808 = \"No\", C808>D808), \"Yes\", \"No\"),\"No\")","v":"No"},{"$f":"IF(SellAllowed=\"Yes\",IF(AND(G808 = \"Yes\", C808<E808), \"Yes\", \"No\"),\"No\")","v":"No"},{"$f":"IF(I808 = \"Yes\", M807/(C808+CostBuy), IF(J808 = \"Yes\", 0, K807))","v":58700.150152854243},null,{"$f":"IF(I808 = \"Yes\", M807-(C808+CostBuy)*K808, IF(J808=\"Yes\", M807+(C808-CostSell)*K807, M807+K808*Rate))","v":67505.172675782349}]
[null,1937.04,17.010000000000002,17.516666666666669,17.127500000000001,null,"Yes",null,{"$f":"IF(BuyAllowed=\"Yes\",IF(AND(G809 = \"No\", C809>D809), \"Yes\", \"No\"),\"No\")","v":"No"},{"$f":"IF(SellAllowed=\"Yes\",IF(AND(G809 = \"Yes\", C809<E809), \"Yes\", \"No\"),\"No\")","v":"Yes"},{"$f":"IF(I809 = \"Yes\", M808/(C809+CostBuy), IF(J809 = \"Yes\", 0, K808))","v":0},null,{"$f":"IF(I809 = \"Yes\", M808-(C809+CostBuy)*K809, IF(J809=\"Yes\", M808+(C809-CostSell)*K808, M808+K809*Rate))","v":1062472.7177666619}]
[null,1937.05,16.25,17.536666666666669,17.27,null,"No",null,{"$f":"IF(BuyAllowed=\"Yes\",IF(AND(G810 = \"No\", C810>D810), \"Yes\", \"No\"),\"No\")","v":"No"},{"$f":"IF(SellAllowed=\"Yes\",IF(AND(G810 = \"Yes\", C810<E810), \"Yes\", \"No\"),\"No\")","v":"No"},{"$f":"IF(I810 = \"Yes\", M809/(C810+CostBuy), IF(J810 = \"Yes\", 0, K809))","v":0},null,{"$f":"IF(I810 = \"Yes\", M809-(C810+CostBuy)*K810, IF(J810=\"Yes\", M809+(C810-CostSell)*K809, M809+K810*Rate))","v":1062472.7177666619}]
[null,1937.06,15.64,17.351666666666667,17.295000000000002,null,"No",null,{"$f":"IF(BuyAllowed=\"Yes\",IF(AND(G811 = \"No\", C811>D811), \"Yes\", \"No\"),\"No\")","v":"No"},{"$f":"IF(SellAllowed=\"Yes\",IF(AND(G811 = \"Yes\", C811<E811), \"Yes\", \"No\"),\"No\")","v":"No"},{"$f":"IF(I811 = \"Yes\", M810/(C811+CostBuy), IF(J811 = \"Yes\", 0, K810))","v":0},null,{"$f":"IF(I811 = \"Yes\", M810-(C811+CostBuy)*K811, IF(J811=\"Yes\", M810+(C811-CostSell)*K810, M810+K811*Rate))","v":1062472.7177666619}]
[null,1937.07,16.57,17.115000000000002,17.138750000000002,null,"No",null,{"$f":"IF(BuyAllowed=\"Yes\",IF(AND(G812 = \"No\", C812>D812), \"Yes\", \"No\"),\"No\")","v":"No"},{"$f":"IF(SellAllowed=\"Yes\",IF(AND(G812 = \"Yes\", C812<E812), \"Yes\", \"No\"),\"No\")","v":"No"},{"$f":"IF(I812 = \"Yes\", M811/(C812+CostBuy), IF(J812 = \"Yes\", 0, K811))","v":0},null,{"$f":"IF(I812 = \"Yes\", M811-(C812+CostBuy)*K812, IF(J812=\"Yes\", M811+(C812-CostSell)*K811, M811+K812*Rate))","v":1062472.7177666619}]
[null,1937.08,16.739999999999998,16.945000000000004,17.04,null,"No",null,{"$f":"IF(BuyAllowed=\"Yes\",IF(AND(G813 = \"No\", C813>D813), \"Yes\", \"No\"),\"No\")","v":"No"},{"$f":"IF(SellAllowed=\"Yes\",IF(AND(G813 = \"Yes\", C813<E813), \"Yes\", \"No\"),\"No\")","v":"No"},{"$f":"IF(I813 = \"Yes\", M812/(C813+CostBuy), IF(J813 = \"Yes\", 0, K812))","v":0},null,{"$f":"IF(I813 = \"Yes\", M812-(C813+CostBuy)*K813, IF(J813=\"Yes\", M812+(C813-CostSell)*K812, M812+K813*Rate))","v":1062472.7177666619}]
[null,1937.09,14.37,16.716666666666665,17.000000000000004,null,"No",null,{"$f":"IF(BuyAllowed=\"Yes\",IF(AND(G814 = \"No\", C814>D814), \"Yes\", \"No\"),\"No\")","v":"No"},{"$f":"IF(SellAllowed=\"Yes\",IF(AND(G814 = \"Yes\", C814<E814), \"Yes\", \"No\"),\"No\")","v":"No"},{"$f":"IF(I814 = \"Yes\", M813/(C814+CostBuy), IF(J814 = \"Yes\", 0, K813))","v":0},null,{"$f":"IF(I814 = \"Yes\", M813-(C814+CostBuy)*K814, IF(J814=\"Yes\", M813+(C814-CostSell)*K813, M813+K814*Rate))","v":1062472.7177666619}]
[null,1937.1,12.28,16.096666666666668,16.5975,null,"No",null,{"$f":"IF(BuyAllowed=\"Yes\",IF(AND(G815 = \"No\", C815>D815), \"Yes\", \"No\"),\"No\")","v":"No"},{"$f":"IF(SellAllowed=\"Yes\",IF(AND(G815 = \"Yes\", C815<E815), \"Yes\", \"No\"),\"No\")","v":"No"},{"$f":"IF(I815 = \"Yes\", M814/(C815+CostBuy), IF(J815 = \"Yes\", 0, K814))","v":0},null,{"$f":"IF(I815 = \"Yes\", M814-(C815+CostBuy)*K815, IF(J815=\"Yes\", M814+(C815-CostSell)*K814, M814+K815*Rate))","v":1062472.7177666619}]
[null,1937.11,11.2,15.308333333333335,15.86875,null,"No",null,{"$f":"IF(BuyAllowed=\"Yes\",IF(AND(G816 = \"No\", C816>D816), \"Yes\", \"No\"),\"No\")","v":"No"},{"$f":"IF(SellAllowed=\"Yes\",IF(AND(G816 = \"Yes\", C816<E816), \"Yes\", \"No\"),\"No\")","v":"No"},{"$f":"IF(I816 = \"Yes\", M815/(C816+CostBuy), IF(J816 = \"Yes\", 0, K815))","v":0},null,{"$f":"IF(I816 = \"Yes\", M815-(C816+CostBuy)*K816, IF(J816=\"Yes\", M815+(C816-CostSell)*K815, M815+K816*Rate))","v":1062472.7177666619}]
[null,1937.12,11.02,14.466666666666667,15.0075,null,"No",null,{"$f":"IF(BuyAllowed=\"Yes\",IF(AND(G817 = \"No\", C817>D817), \"Yes\", \"No\"),\"No\")","v":"No"},{"$f":"IF(SellAllowed=\"Yes\",IF(AND(G817 = \"Yes\", C817<E817), \"Yes\", \"No\"),\"No\")","v":"No"},{"$f":"IF(I817 = \"Yes\", M816/(C817+CostBuy), IF(J817 = \"Yes\", 0, K816))","v":0},null,{"$f":"IF(I817 = \"Yes\", M816-(C817+CostBuy)*K817, IF(J817=\"Yes\", M816+(C817-CostSell)*K816, M816+K817*Rate))","v":1062472.7177666619}]
[null,1938.01,11.31,13.696666666666665,14.258750000000001,null,"No",null,{"$f":"IF(BuyAllowed=\"Yes\",IF(AND(G818 = \"No\", C818>D818), \"Yes\", \"No\"),\"No\")","v":"No"},{"$f":"IF(SellAllowed=\"Yes\",IF(AND(G818 = \"Yes\", C818<E818), \"Yes\", \"No\"),\"No\")","v":"No"},{"$f":"IF(I818 = \"Yes\", M817/(C818+CostBuy), IF(J818 = \"Yes\", 0, K817))","v":0},null,{"$f":"IF(I818 = \"Yes\", M817-(C818+CostBuy)*K818, IF(J818=\"Yes\", M817+(C818-CostSell)*K817, M817+K818*Rate))","v":1062472.7177666619}]
[null,1938.02,11.04,12.82,13.641249999999999,null,"No",null,{"$f":"IF(BuyAllowed=\"Yes\",IF(AND(G819 = \"No\", C819>D819), \"Yes\", \"No\"),\"No\")","v":"No"},{"$f":"IF(SellAllowed=\"Yes\",IF(AND(G819 = \"Yes\", C819<E819), \"Yes\", \"No\"),\"No\")","v":"No"},{"$f":"IF(I819 = \"Yes\", M818/(C819+CostBuy), IF(J819 = \"Yes\", 0, K818))","v":0},null,{"$f":"IF(I819 = \"Yes\", M818-(C819+CostBuy)*K819, IF(J819=\"Yes\", M818+(C819-CostSell)*K818, M818+K819*Rate))","v":1062472.7177666619}]
[null,1938.03,10.31,11.87,13.06625,null,"No",null,{"$f":"IF(BuyAllowed=\"Yes\",IF(AND(G820 = \"No\", C820>D820), \"Yes\", \"No\"),\"No\")","v":"No"},{"$f":"IF(SellAllowed=\"Yes\",IF(AND(G820 = \"Yes\", C820<E820), \"Yes\", \"No\"),\"No\")","v":"No"},{"$f":"IF(I820 = \"Yes\", M819/(C820+CostBuy), IF(J820 = \"Yes\", 0, K819))","v":0},null,{"$f":"IF(I820 = \"Yes\", M819-(C820+CostBuy)*K820, IF(J820=\"Yes\", M819+(C820-CostSell)*K819, M819+K820*Rate))","v":1062472.7177666619}]
[null,1938.04,9.89,11.193333333333333,12.283750000000001,null,"No",null,{"$f":"IF(BuyAllowed=\"Yes\",IF(AND(G821 = \"No\", C821>D821), \"Yes\", \"No\"),\"No\")","v":"No"},{"$f":"IF(SellAllowed=\"Yes\",IF(AND(G821 = \"Yes\", C821<E821), \"Yes\", \"No\"),\"No\")","v":"No"},{"$f":"IF(I821 = \"Yes\", M820/(C821+CostBuy), IF(J821 = \"Yes\", 0, K820))","v":0},null,{"$f":"IF(I821 = \"Yes\", M820-(C821+CostBuy)*K821, IF(J821=\"Yes\", M820+(C821-CostSell)*K820, M820+K821*Rate))","v":1062472.7177666619}]
[null,1938.05,9.98,10.795000000000002,11.4275,null,"No",null,{"$f":"IF(BuyAllowed=\"Yes\",IF(AND(G822 = \"No\", C822>D822), \"Yes\", \"No\"),\"No\")","v":"No"},{"$f":"IF(SellAllowed=\"Yes\",IF(AND(G822 = \"Yes\", C822<E822), \"Yes\", \"No\"),\"No\")","v":"No"},{"$f":"IF(I822 = \"Yes\", M821/(C822+CostBuy), IF(J822 = \"Yes\", 0, K821))","v":0},null,{"$f":"IF(I822 = \"Yes\", M821-(C822+CostBuy)*K822, IF(J822=\"Yes\", M821+(C822-CostSell)*K821, M821+K822*Rate))","v":1062472.7177666619}]
[null,1938.06,10.210000000000001,10.591666666666667,10.87875,null,"No",null,{"$f":"IF(BuyAllowed=\"Yes\",IF(AND(G823 = \"No\", C823>D823), \"Yes\", \"No\"),\"No\")","v":"No"},{"$f":"IF(SellAllowed=\"Yes\",IF(AND(G823 = \"Yes\", C823<E823), \"Yes\", \"No\"),\"No\")","v":"No"},{"$f":"IF(I823 = \"Yes\", M822/(C823+CostBuy), IF(J823 = \"Yes\", 0, K822))","v":0},null,{"$f":"IF(I823 = \"Yes\", M822-(C823+CostBuy)*K823, IF(J823=\"Yes\", M822+(C823-CostSell)*K822, M822+K823*Rate))","v":1062472.7177666619}]
[null,1938.07,12.24,10.456666666666667,10.620000000000001,null,"No",null,{"$f":"IF(BuyAllowed=\"Yes\",IF(AND(G824 = \"No\", C824>D824), \"Yes\", \"No\"),\"No\")","v":"Yes"},{"$f":"IF(SellAllowed=\"Yes\",IF(AND(G824 = \"Yes\", C824<E824), \"Yes\", \"No\"),\"No\")","v":"No"},{"$f":"IF(I824 = \"Yes\", M823/(C824+CostBuy), IF(J824 = \"Yes\", 0, K823))","v":86591.093542515242},null,{"$f":"IF(I824 = \"Yes\", M823-(C824+CostBuy)*K824, IF(J824=\"Yes\", M823+(C824-CostSell)*K823, M823+K824*Rate))","v":0}]
[null,1938.08,12.31,10.611666666666666,10.749999999999998,null,"Yes",null,{"$f":"IF(BuyAllowed=\"Yes\",IF(AND(G825 = \"No\", C825>D825), \"Yes\", \"No\"),\"No\")","v":"No"},{"$f":"IF(SellAllowed=\"Yes\",IF(AND(G825 = \"Yes\", C825<E825), \"Yes\", \"No\"),\"No\")","v":"No"},{"$f":"IF(I825 = \"Yes\", M824/(C825+CostBuy), IF(J825 = \"Yes\", 0, K824))","v":86591.093542515242},null,{"$f":"IF(I825 = \"Yes\", M824-(C825+CostBuy)*K825, IF(J825=\"Yes\", M824+(C825-CostSell)*K824, M824+K825*Rate))","v":4329.5546771257623}]
[null,1938.09,11.75,10.823333333333332,10.911250000000001,null,"Yes",null,{"$f":"IF(BuyAllowed=\"Yes\",IF(AND(G826 = \"No\", C826>D826), \"Yes\", \"No\"),\"No\")","v":"No"},{"$f":"IF(SellAllowed=\"Yes\",IF(AND(G826 = \"Yes\", C826<E826), \"Yes\", \"No\"),\"No\")","v":"No"},{"$f":"IF(I826 = \"Yes\", M825/(C826+CostBuy), IF(J826 = \"Yes\", 0, K825))","v":86591.093542515242},null,{"$f":"IF(I826 = \"Yes\", M825-(C826+CostBuy)*K826, IF(J826=\"Yes\", M825+(C826-CostSell)*K825, M825+K826*Rate))","v":8659.1093542515246}]
[null,1938.1,13.06,11.063333333333333,10.96625,null,"Yes",null,{"$f":"IF(BuyAllowed=\"Yes\",IF(AND(G827 = \"No\", C827>D827), \"Yes\", \"No\"),\"No\")","v":"No"},{"$f":"IF(SellAllowed=\"Yes\",IF(AND(G827 = \"Yes\", C827<E827), \"Yes\", \"No\"),\"No\")","v":"No"},{"$f":"IF(I827 = \"Yes\", M826/(C827+CostBuy), IF(J827 = \"Yes\", 0, K826))","v":86591.093542515242},null,{"$f":"IF(I827 = \"Yes\", M826-(C827+CostBuy)*K827, IF(J827=\"Yes\", M826+(C827-CostSell)*K826, M826+K827*Rate))","v":12988.664031377288}]
[null,1938.11,13.07,11.591666666666667,11.21875,null,"Yes",null,{"$f":"IF(BuyAllowed=\"Yes\",IF(AND(G828 = \"No\", C828>D828), \"Yes\", \"No\"),\"No\")","v":"No"},{"$f":"IF(SellAllowed=\"Yes\",IF(AND(G828 = \"Yes\", C828<E828), \"Yes\", \"No\"),\"No\")","v":"No"},{"$f":"IF(I828 = \"Yes\", M827/(C828+CostBuy), IF(J828 = \"Yes\", 0, K827))","v":86591.093542515242},null,{"$f":"IF(I828 = \"Yes\", M827-(C828+CostBuy)*K828, IF(J828=\"Yes\", M827+(C828-CostSell)*K827, M827+K828*Rate))","v":17318.218708503049}]
[null,1938.12,12.69,12.106666666666669,11.563749999999999,null,"Yes",null,{"$f":"IF(BuyAllowed=\"Yes\",IF(AND(G829 = \"No\", C829>D829), \"Yes\", \"No\"),\"No\")","v":"No"},{"$f":"IF(SellAllowed=\"Yes\",IF(AND(G829 = \"Yes\", C829<E829), \"Yes\", \"No\"),\"No\")","v":"No"},{"$f":"IF(I829 = \"Yes\", M828/(C829+CostBuy), IF(J829 = \"Yes\", 0, K828))","v":86591.093542515242},null,{"$f":"IF(I829 = \"Yes\", M828-(C829+CostBuy)*K829, IF(J829=\"Yes\", M828+(C829-CostSell)*K828, M828+K829*Rate))","v":21647.773385628811}]
[null,1939.01,12.5,12.520000000000001,11.91375,null,"Yes",null,{"$f":"IF(BuyAllowed=\"Yes\",IF(AND(G830 = \"No\", C830>D830), \"Yes\", \"No\"),\"No\")","v":"No"},{"$f":"IF(SellAllowed=\"Yes\",IF(AND(G830 = \"Yes\", C830<E830), \"Yes\", \"No\"),\"No\")","v":"No"},{"$f":"IF(I830 = \"Yes\", M829/(C830+CostBuy), IF(J830 = \"Yes\", 0, K829))","v":86591.093542515242},null,{"$f":"IF(I830 = \"Yes\", M829-(C830+CostBuy)*K830, IF(J830=\"Yes\", M829+(C830-CostSell)*K829, M829+K830*Rate))","v":25977.328062754572}]
[null,1939.02,12.4,12.563333333333333,12.228750000000002,null,"Yes",null,{"$f":"IF(BuyAllowed=\"Yes\",IF(AND(G831 = \"No\", C831>D831), \"Yes\", \"No\"),\"No\")","v":"No"},{"$f":"IF(SellAllowed=\"Yes\",IF(AND(G831 = \"Yes\", C831<E831), \"Yes\", \"No\"),\"No\")","v":"No"},{"$f":"IF(I831 = \"Yes\", M830/(C831+CostBuy), IF(J831 = \"Yes\", 0, K830))","v":86591.093542515242},null,{"$f":"IF(I831 = \"Yes\", M830-(C831+CostBuy)*K831, IF(J831=\"Yes\", M830+(C831-CostSell)*K830, M830+K831*Rate))","v":30306.882739880333}]
[null,1939.03,12.39,12.578333333333333,12.502500000000001,null,"Yes",null,{"$f":"IF(BuyAllowed=\"Yes\",IF(AND(G832 = \"No\", C832>D832), \"Yes\", \"No\"),\"No\")","v":"No"},{"$f":"IF(SellAllowed=\"Yes\",IF(AND(G832 = \"Yes\", C832<E832), \"Yes\", \"No\"),\"No\")","v":"Yes"},{"$f":"IF(I832 = \"Yes\", M831/(C832+CostBuy), IF(J832 = \"Yes\", 0, K831))","v":0},null,{"$f":"IF(I832 = \"Yes\", M831-(C832+CostBuy)*K832, IF(J832=\"Yes\", M831+(C832-CostSell)*K831, M831+K832*Rate))","v":1097975.0661190932}]
[null,1939.04,10.83,12.685,12.52125,null,"No",null,{"$f":"IF(BuyAllowed=\"Yes\",IF(AND(G833 = \"No\", C833>D833), \"Yes\", \"No\"),\"No\")","v":"No"},{"$f":"IF(SellAllowed=\"Yes\",IF(AND(G833 = \"Yes\", C833<E833), \"Yes\", \"No\"),\"No\")","v":"No"},{"$f":"IF(I833 = \"Yes\", M832/(C833+CostBuy), IF(J833 = \"Yes\", 0, K832))","v":0},null,{"$f":"IF(I833 = \"Yes\", M832-(C833+CostBuy)*K833, IF(J833=\"Yes\", M832+(C833-CostSell)*K832, M832+K833*Rate))","v":1097975.0661190932}]
[null,1939.05,11.23,12.313333333333333,12.33625,null,"No",null,{"$f":"IF(BuyAllowed=\"Yes\",IF(AND(G834 = \"No\", C834>D834), \"Yes\", \"No\"),\"No\")","v":"No"},{"$f":"IF(SellAllowed=\"Yes\",IF(AND(G834 = \"Yes\", C834<E834), \"Yes\", \"No\"),\"No\")","v":"No"},{"$f":"IF(I834 = \"Yes\", M833/(C834+CostBuy), IF(J834 = \"Yes\", 0, K833))","v":0},null,{"$f":"IF(I834 = \"Yes\", M833-(C834+CostBuy)*K834, IF(J834=\"Yes\", M833+(C834-CostSell)*K833, M833+K834*Rate))","v":1097975.0661190932}]
[null,1939.06,11.43,12.006666666666666,12.27125,null,"No",null,{"$f":"IF(BuyAllowed=\"Yes\",IF(AND(G835 = \"No\", C835>D835), \"Yes\", \"No\"),\"No\")","v":"No"},{"$f":"IF(SellAllowed=\"Yes\",IF(AND(G835 = \"Yes\", C835<E835), \"Yes\", \"No\"),\"No\")","v":"No"},{"$f":"IF(I835 = \"Yes\", M834/(C835+CostBuy), IF(J835 = \"Yes\", 0, K834))","v":0},null,{"$f":"IF(I835 = \"Yes\", M834-(C835+CostBuy)*K835, IF(J835=\"Yes\", M834+(C835-CostSell)*K834, M834+K835*Rate))","v":1097975.0661190932}]
[null,1939.07,11.71,11.796666666666667,12.067499999999999,null,"No",null,{"$f":"IF(BuyAllowed=\"Yes\",IF(AND(G836 = \"No\", C836>D836), \"Yes\", \"No\"),\"No\")","v":"No"},{"$f":"IF(SellAllowed=\"Yes\",IF(AND(G836 = \"Yes\", C836<E836), \"Yes\", \"No\"),\"No\")","v":"No"},{"$f":"IF(I836 = \"Yes\", M835/(C836+CostBuy), IF(J836 = \"Yes\", 0, K835))","v":0},null,{"$f":"IF(I836 = \"Yes\", M835-(C836+CostBuy)*K836, IF(J836=\"Yes\", M835+(C836-CostSell)*K835, M835+K836*Rate))","v":1097975.0661190932}]
[null,1939.08,11.54,11.664999999999999,11.897500000000001,null,"No",null,{"$f":"IF(BuyAllowed=\"Yes\",IF(AND(G837 = \"No\", C837>D837), \"Yes\", \"No\"),\"No\")","v":"No"},{"$f":"IF(SellAllowed=\"Yes\",IF(AND(G837 = \"Yes\", C837<E837), \"Yes\", \"No\"),\"No\")","v":"No"},{"$f":"IF(I837 = \"Yes\", M836/(C837+CostBuy), IF(J837 = \"Yes\", 0, K836))","v":0},null,{"$f":"IF(I837 = \"Yes\", M836-(C837+CostBuy)*K837, IF(J837=\"Yes\", M836+(C837-CostSell)*K836, M836+K837*Rate))","v":1097975.0661190932}]
[null,1939.09,12.77,11.521666666666667,11.75375,null,"No",null,{"$f":"IF(BuyAllowed=\"Yes\",IF(AND(G838 = \"No\", C838>D838), \"Yes\", \"No\"),\"No\")","v":"Yes"},{"$f":"IF(SellAllowed=\"Yes\",IF(AND(G838 = \"Yes\", C838<E838), \"Yes\", \"No\"),\"No\")","v":"No"},{"$f":"IF(I838 = \"Yes\", M837/(C838+CostBuy), IF(J838 = \"Yes\", 0, K837))","v":85779.302040554161},null,{"$f":"IF(I838 = \"Yes\", M837-(C838+CostBuy)*K838, IF(J838=\"Yes\", M837+(C838-CostSell)*K837, M837+K838*Rate))","v":0}]
[null,1939.1,12.9,11.585000000000001,11.7875,null,"Yes",null,{"$f":"IF(BuyAllowed=\"Yes\",IF(AND(G839 = \"No\", C839>D839), \"Yes\", \"No\"),\"No\")","v":"No"},{"$f":"IF(SellAllowed=\"Yes\",IF(AND(G839 = \"Yes\", C839<E839), \"Yes\", \"No\"),\"No\")","v":"No"},{"$f":"IF(I839 = \"Yes\", M838/(C839+CostBuy), IF(J839 = \"Yes\", 0, K838))","v":85779.302040554161},null,{"$f":"IF(I839 = \"Yes\", M838-(C839+CostBuy)*K839, IF(J839=\"Yes\", M838+(C839-CostSell)*K838, M838+K839*Rate))","v":4288.9651020277079}]
[null,1939.11,12.67,11.930000000000001,11.85,null,"Yes",null,{"$f":"IF(BuyAllowed=\"Yes\",IF(AND(G840 = \"No\", C840>D840), \"Yes\", \"No\"),\"No\")","v":"No"},{"$f":"IF(SellAllowed=\"Yes\",IF(AND(G840 = \"Yes\", C840<E840), \"Yes\", \"No\"),\"No\")","v":"No"},{"$f":"IF(I840 = \"Yes\", M839/(C840+CostBuy), IF(J840 = \"Yes\", 0, K839))","v":85779.302040554161},null,{"$f":"IF(I840 = \"Yes\", M839-(C840+CostBuy)*K840, IF(J840=\"Yes\", M839+(C840-CostSell)*K839, M839+K840*Rate))","v":8577.9302040554157}]
[null,1939.12,12.37,12.17,11.885000000000002,null,"Yes",null,{"$f":"IF(BuyAllowed=\"Yes\",IF(AND(G841 = \"No\", C841>D841), \"Yes\", \"No\"),\"No\")","v":"No"},{"$f":"IF(SellAllowed=\"Yes\",IF(AND(G841 = \"Yes\", C841<E841), \"Yes\", \"No\"),\"No\")","v":"No"},{"$f":"IF(I841 = \"Yes\", M840/(C841+CostBuy), IF(J841 = \"Yes\", 0, K840))","v":85779.302040554161},null,{"$f":"IF(I841 = \"Yes\", M840-(C841+CostBuy)*K841, IF(J841=\"Yes\", M840+(C841-CostSell)*K840, M840+K841*Rate))","v":12866.895306083123}]
[null,1940.01,12.3,12.326666666666666,12.077500000000002,null,"Yes",null,{"$f":"IF(BuyAllowed=\"Yes\",IF(AND(G842 = \"No\", C842>D842), \"Yes\", \"No\"),\"No\")","v":"No"},{"$f":"IF(SellAllowed=\"Yes\",IF(AND(G842 = \"Yes\", C842<E842), \"Yes\", \"No\"),\"No\")","v":"No"},{"$f":"IF(I842 = \"Yes\", M841/(C842+CostBuy), IF(J842 = \"Yes\", 0, K841))","v":85779.302040554161},null,{"$f":"IF(I842 = \"Yes\", M841-(C842+CostBuy)*K842, IF(J842=\"Yes\", M841+(C842-CostSell)*K841, M841+K842*Rate))","v":17155.860408110831}]
[null,1940.02,12.22,12.424999999999999,12.21125,null,"Yes",null,{"$f":"IF(BuyAllowed=\"Yes\",IF(AND(G843 = \"No\", C843>D843), \"Yes\", \"No\"),\"No\")","v":"No"},{"$f":"IF(SellAllowed=\"Yes\",IF(AND(G843 = \"Yes\", C843<E843), \"Yes\", \"No\"),\"No\")","v":"No"},{"$f":"IF(I843 = \"Yes\", M842/(C843+CostBuy), IF(J843 = \"Yes\", 0, K842))","v":85779.302040554161},null,{"$f":"IF(I843 = \"Yes\", M842-(C843+CostBuy)*K843, IF(J843=\"Yes\", M842+(C843-CostSell)*K842, M842+K843*Rate))","v":21444.82551013854}]
[null,1940.03,12.15,12.538333333333334,12.309999999999999,null,"Yes",null,{"$f":"IF(BuyAllowed=\"Yes\",IF(AND(G844 = \"No\", C844>D844), \"Yes\", \"No\"),\"No\")","v":"No"},{"$f":"IF(SellAllowed=\"Yes\",IF(AND(G844 = \"Yes\", C844<E844), \"Yes\", \"No\"),\"No\")","v":"Yes"},{"$f":"IF(I844 = \"Yes\", M843/(C844+CostBuy), IF(J844 = \"Yes\", 0, K843))","v":0},null,{"$f":"IF(I844 = \"Yes\", M843-(C844+CostBuy)*K844, IF(J844=\"Yes\", M843+(C844-CostSell)*K843, M843+K844*Rate))","v":1058516.5871804385}]
[null,1940.04,12.27,12.435,12.365,null,"No",null,{"$f":"IF(BuyAllowed=\"Yes\",IF(AND(G845 = \"No\", C845>D845), \"Yes\", \"No\"),\"No\")","v":"No"},{"$f":"IF(SellAllowed=\"Yes\",IF(AND(G845 = \"Yes\", C845<E845), \"Yes\", \"No\"),\"No\")","v":"No"},{"$f":"IF(I845 = \"Yes\", M844/(C845+CostBuy), IF(J845 = \"Yes\", 0, K844))","v":0},null,{"$f":"IF(I845 = \"Yes\", M844-(C845+CostBuy)*K845, IF(J845=\"Yes\", M844+(C845-CostSell)*K844, M844+K845*Rate))","v":1058516.5871804385}]
[null,1940.05,10.58,12.33,12.456250000000001,null,"No",null,{"$f":"IF(BuyAllowed=\"Yes\",IF(AND(G846 = \"No\", C846>D846), \"Yes\", \"No\"),\"No\")","v":"No"},{"$f":"IF(SellAllowed=\"Yes\",IF(AND(G846 = \"Yes\", C846<E846), \"Yes\", \"No\"),\"No\")","v":"No"},{"$f":"IF(I846 = \"Yes\", M845/(C846+CostBuy), IF(J846 = \"Yes\", 0, K845))","v":0},null,{"$f":"IF(I846 = \"Yes\", M845-(C846+CostBuy)*K846, IF(J846=\"Yes\", M845+(C846-CostSell)*K845, M845+K846*Rate))","v":1058516.5871804385}]
[null,1940.06,9.67,11.981666666666667,12.182499999999999,null,"No",null,{"$f":"IF(BuyAllowed=\"Yes\",IF(AND(G847 = \"No\", C847>D847), \"Yes\", \"No\"),\"No\")","v":"No"},{"$f":"IF(SellAllowed=\"Yes\",IF(AND(G847 = \"Yes\", C847<E847), \"Yes\", \"No\"),\"No\")","v":"No"},{"$f":"IF(I847 = \"Yes\", M846/(C847+CostBuy), IF(J847 = \"Yes\", 0, K846))","v":0},null,{"$f":"IF(I847 = \"Yes\", M846-(C847+CostBuy)*K847, IF(J847=\"Yes\", M846+(C847-CostSell)*K846, M846+K847*Rate))","v":1058516.5871804385}]
[null,1940.07,9.99,11.531666666666666,11.77875,null,"No",null,{"$f":"IF(BuyAllowed=\"Yes\",IF(AND(G848 = \"No\", C848>D848), \"Yes\", \"No\"),\"No\")","v":"No"},{"$f":"IF(SellAllowed=\"Yes\",IF(AND(G848 = \"Yes\", C848<E848), \"Yes\", \"No\"),\"No\")","v":"No"},{"$f":"IF(I848 = \"Yes\", M847/(C848+CostBuy), IF(J848 = \"Yes\", 0, K847))","v":0},null,{"$f":"IF(I848 = \"Yes\", M847-(C848+CostBuy)*K848, IF(J848=\"Yes\", M847+(C848-CostSell)*K847, M847+K848*Rate))","v":1058516.5871804385}]
[null,1940.08,10.199999999999999,11.146666666666667,11.44375,null,"No",null,{"$f":"IF(BuyAllowed=\"Yes\",IF(AND(G849 = \"No\", C849>D849), \"Yes\", \"No\"),\"No\")","v":"No"},{"$f":"IF(SellAllowed=\"Yes\",IF(AND(G849 = \"Yes\", C849<E849), \"Yes\", \"No\"),\"No\")","v":"No"},{"$f":"IF(I849 = \"Yes\", M848/(C849+CostBuy), IF(J849 = \"Yes\", 0, K848))","v":0},null,{"$f":"IF(I849 = \"Yes\", M848-(C849+CostBuy)*K849, IF(J849=\"Yes\", M848+(C849-CostSell)*K848, M848+K849*Rate))","v":1058516.5871804385}]
[null,1940.09,10.63,10.81,11.172499999999999,null,"No",null,{"$f":"IF(BuyAllowed=\"Yes\",IF(AND(G850 = \"No\", C850>D850), \"Yes\", \"No\"),\"No\")","v":"No"},{"$f":"IF(SellAllowed=\"Yes\",IF(AND(G850 = \"Yes\", C850<E850), \"Yes\", \"No\"),\"No\")","v":"No"},{"$f":"IF(I850 = \"Yes\", M849/(C850+CostBuy), IF(J850 = \"Yes\", 0, K849))","v":0},null,{"$f":"IF(I850 = \"Yes\", M849-(C850+CostBuy)*K850, IF(J850=\"Yes\", M849+(C850-CostSell)*K849, M849+K850*Rate))","v":1058516.5871804385}]
[null,1940.1,10.73,10.556666666666668,10.963749999999999,null,"No",null,{"$f":"IF(BuyAllowed=\"Yes\",IF(AND(G851 = \"No\", C851>D851), \"Yes\", \"No\"),\"No\")","v":"Yes"},{"$f":"IF(SellAllowed=\"Yes\",IF(AND(G851 = \"Yes\", C851<E851), \"Yes\", \"No\"),\"No\")","v":"No"},{"$f":"IF(I851 = \"Yes\", M850/(C851+CostBuy), IF(J851 = \"Yes\", 0, K850))","v":98375.147507475689},null,{"$f":"IF(I851 = \"Yes\", M850-(C851+CostBuy)*K851, IF(J851=\"Yes\", M850+(C851-CostSell)*K850, M850+K851*Rate))","v":0}]
[null,1940.11,10.98,10.299999999999999,10.7775,null,"Yes",null,{"$f":"IF(BuyAllowed=\"Yes\",IF(AND(G852 = \"No\", C852>D852), \"Yes\", \"No\"),\"No\")","v":"No"},{"$f":"IF(SellAllowed=\"Yes\",IF(AND(G852 = \"Yes\", C852<E852), \"Yes\", \"No\"),\"No\")","v":"No"},{"$f":"IF(I852 = \"Yes\", M851/(C852+CostBuy), IF(J852 = \"Yes\", 0, K851))","v":98375.147507475689},null,{"$f":"IF(I852 = \"Yes\", M851-(C852+CostBuy)*K852, IF(J852=\"Yes\", M851+(C852-CostSell)*K851, M851+K852*Rate))","v":4918.7573753737852}]
[null,1940.12,10.53,10.366666666666667,10.631250000000001,null,"Yes",null,{"$f":"IF(BuyAllowed=\"Yes\",IF(AND(G853 = \"No\", C853>D853), \"Yes\", \"No\"),\"No\")","v":"No"},{"$f":"IF(SellAllowed=\"Yes\",IF(AND(G853 = \"Yes\", C853<E853), \"Yes\", \"No\"),\"No\")","v":"Yes"},{"$f":"IF(I853 = \"Yes\", M852/(C853+CostBuy), IF(J853 = \"Yes\", 0, K852))","v":0},null,{"$f":"IF(I853 = \"Yes\", M852-(C853+CostBuy)*K853, IF(J853=\"Yes\", M852+(C853-CostSell)*K852, M852+K853*Rate))","v":1034906.5517786441}]
[null,1941.01,10.55,10.51,10.41375,null,"No",null,{"$f":"IF(BuyAllowed=\"Yes\",IF(AND(G854 = \"No\", C854>D854), \"Yes\", \"No\"),\"No\")","v":"Yes"},{"$f":"IF(SellAllowed=\"Yes\",IF(AND(G854 = \"Yes\", C854<E854), \"Yes\", \"No\"),\"No\")","v":"No"},{"$f":"IF(I854 = \"Yes\", M853/(C854+CostBuy), IF(J854 = \"Yes\", 0, K853))","v":97817.254421421938},null,{"$f":"IF(I854 = \"Yes\", M853-(C854+CostBuy)*K854, IF(J854=\"Yes\", M853+(C854-CostSell)*K853, M853+K854*Rate))","v":0}]
[null,1941.02,9.89,10.603333333333333,10.41,null,"Yes",null,{"$f":"IF(BuyAllowed=\"Yes\",IF(AND(G855 = \"No\", C855>D855), \"Yes\", \"No\"),\"No\")","v":"No"},{"$f":"IF(SellAllowed=\"Yes\",IF(AND(G855 = \"Yes\", C855<E855), \"Yes\", \"No\"),\"No\")","v":"Yes"},{"$f":"IF(I855 = \"Yes\", M854/(C855+CostBuy), IF(J855 = \"Yes\", 0, K854))","v":0},null,{"$f":"IF(I855 = \"Yes\", M854-(C855+CostBuy)*K855, IF(J855=\"Yes\", M854+(C855-CostSell)*K854, M854+K855*Rate))","v":961543.61096257763}]
[null,1941.03,9.9499999999999993,10.551666666666668,10.4375,null,"No",null,{"$f":"IF(BuyAllowed=\"Yes\",IF(AND(G856 = \"No\", C856>D856), \"Yes\", \"No\"),\"No\")","v":"No"},{"$f":"IF(SellAllowed=\"Yes\",IF(AND(G856 = \"Yes\", C856<E856), \"Yes\", \"No\"),\"No\")","v":"No"},{"$f":"IF(I856 = \"Yes\", M855/(C856+CostBuy), IF(J856 = \"Yes\", 0, K855))","v":0},null,{"$f":"IF(I856 = \"Yes\", M855-(C856+CostBuy)*K856, IF(J856=\"Yes\", M855+(C856-CostSell)*K855, M855+K856*Rate))","v":961543.61096257763}]
[null,1941.04,9.64,10.438333333333334,10.432500000000001,null,"No",null,{"$f":"IF(BuyAllowed=\"Yes\",IF(AND(G857 = \"No\", C857>D857), \"Yes\", \"No\"),\"No\")","v":"No"},{"$f":"IF(SellAllowed=\"Yes\",IF(AND(G857 = \"Yes\", C857<E857), \"Yes\", \"No\"),\"No\")","v":"No"},{"$f":"IF(I857 = \"Yes\", M856/(C857+CostBuy), IF(J857 = \"Yes\", 0, K856))","v":0},null,{"$f":"IF(I857 = \"Yes\", M856-(C857+CostBuy)*K857, IF(J857=\"Yes\", M856+(C857-CostSell)*K856, M856+K857*Rate))","v":961543.61096257763}]
[null,1941.05,9.43,10.256666666666668,10.362500000000001,null,"No",null,{"$f":"IF(BuyAllowed=\"Yes\",IF(AND(G858 = \"No\", C858>D858), \"Yes\", \"No\"),\"No\")","v":"No"},{"$f":"IF(SellAllowed=\"Yes\",IF(AND(G858 = \"Yes\", C858<E858), \"Yes\", \"No\"),\"No\")","v":"No"},{"$f":"IF(I858 = \"Yes\", M857/(C858+CostBuy), IF(J858 = \"Yes\", 0, K857))","v":0},null,{"$f":"IF(I858 = \"Yes\", M857-(C858+CostBuy)*K858, IF(J858=\"Yes\", M857+(C858-CostSell)*K857, M857+K858*Rate))","v":961543.61096257763}]
[null,1941.06,9.76,{"$f":"AVERAGE(C853:C858)","v":9.9983333333333331},{"$f":"AVERAGE(C851:C858)","v":10.212500000000002},null,"No",null,{"$f":"IF(BuyAllowed=\"Yes\",IF(AND(G859 = \"No\", C859>D859), \"Yes\", \"No\"),\"No\")","v":"No"},{"$f":"IF(SellAllowed=\"Yes\",IF(AND(G859 = \"Yes\", C859<E859), \"Yes\", \"No\"),\"No\")","v":"No"},{"$f":"IF(I859 = \"Yes\", M858/(C859+CostBuy), IF(J859 = \"Yes\", 0, K858))","v":0},null,{"$f":"IF(I859 = \"Yes\", M858-(C859+CostBuy)*K859, IF(J859=\"Yes\", M858+(C859-CostSell)*K858, M858+K859*Rate))","v":961543.61096257763}]
[null,1941.07,10.26,9.8699999999999992,10.09125,null,{"$f":"IF(I859 = \"Yes\", \"Yes\", IF(J859=\"Yes\", \"No\", G859))","v":"No"},null,{"$f":"IF(BuyAllowed=\"Yes\",IF(AND(G860 = \"No\", C860>D860), \"Yes\", \"No\"),\"No\")","v":"Yes"},{"$f":"IF(SellAllowed=\"Yes\",IF(AND(G860 = \"Yes\", C860<E860), \"Yes\", \"No\"),\"No\")","v":"No"},{"$f":"IF(I860 = \"Yes\", M859/(C860+CostBuy), IF(J860 = \"Yes\", 0, K859))","v":93444.471424934673},null,{"$f":"IF(I860 = \"Yes\", M859-(C860+CostBuy)*K860, IF(J860=\"Yes\", M859+(C860-CostSell)*K859, M859+K860*Rate))","v":-1.1641532182693481E-10}]
[null,1941.08,10.210000000000001,9.8216666666666654,10.001250000000001,null,"Yes",null,{"$f":"IF(BuyAllowed=\"Yes\",IF(AND(G861 = \"No\", C861>D861), \"Yes\", \"No\"),\"No\")","v":"No"},{"$f":"IF(SellAllowed=\"Yes\",IF(AND(G861 = \"Yes\", C861<E861), \"Yes\", \"No\"),\"No\")","v":"No"},{"$f":"IF(I861 = \"Yes\", M860/(C861+CostBuy), IF(J861 = \"Yes\", 0, K860))","v":93444.471424934673},null,{"$f":"IF(I861 = \"Yes\", M860-(C861+CostBuy)*K861, IF(J861=\"Yes\", M860+(C861-CostSell)*K860, M860+K861*Rate))","v":4672.2235712466172}]
[null,1941.09,10.24,9.875,9.9612499999999997,null,"Yes",null,{"$f":"IF(BuyAllowed=\"Yes\",IF(AND(G862 = \"No\", C862>D862), \"Yes\", \"No\"),\"No\")","v":"No"},{"$f":"IF(SellAllowed=\"Yes\",IF(AND(G862 = \"Yes\", C862<E862), \"Yes\", \"No\"),\"No\")","v":"No"},{"$f":"IF(I862 = \"Yes\", M861/(C862+CostBuy), IF(J862 = \"Yes\", 0, K861))","v":93444.471424934673},null,{"$f":"IF(I862 = \"Yes\", M861-(C862+CostBuy)*K862, IF(J862=\"Yes\", M861+(C862-CostSell)*K861, M861+K862*Rate))","v":9344.4471424933508}]
[null,1941.1,9.83,9.9233333333333338,9.9224999999999977,null,"Yes",null,{"$f":"IF(BuyAllowed=\"Yes\",IF(AND(G863 = \"No\", C863>D863), \"Yes\", \"No\"),\"No\")","v":"No"},{"$f":"IF(SellAllowed=\"Yes\",IF(AND(G863 = \"Yes\", C863<E863), \"Yes\", \"No\"),\"No\")","v":"Yes"},{"$f":"IF(I863 = \"Yes\", M862/(C863+CostBuy), IF(J863 = \"Yes\", 0, K862))","v":0},null,{"$f":"IF(I863 = \"Yes\", M862-(C863+CostBuy)*K863, IF(J863=\"Yes\", M862+(C863-CostSell)*K862, M862+K863*Rate))","v":922296.93296410504}]
[null,1941.11,9.3699999999999992,9.9550000000000001,9.9149999999999991,null,"No",null,{"$f":"IF(BuyAllowed=\"Yes\",IF(AND(G864 = \"No\", C864>D864), \"Yes\", \"No\"),\"No\")","v":"No"},{"$f":"IF(SellAllowed=\"Yes\",IF(AND(G864 = \"Yes\", C864<E864), \"Yes\", \"No\"),\"No\")","v":"No"},{"$f":"IF(I864 = \"Yes\", M863/(C864+CostBuy), IF(J864 = \"Yes\", 0, K863))","v":0},null,{"$f":"IF(I864 = \"Yes\", M863-(C864+CostBuy)*K864, IF(J864=\"Yes\", M863+(C864-CostSell)*K863, M863+K864*Rate))","v":922296.93296410504}]
[null,1941.12,8.76,9.9449999999999985,9.8425000000000011,null,"No",null,{"$f":"IF(BuyAllowed=\"Yes\",IF(AND(G865 = \"No\", C865>D865), \"Yes\", \"No\"),\"No\")","v":"No"},{"$f":"IF(SellAllowed=\"Yes\",IF(AND(G865 = \"Yes\", C865<E865), \"Yes\", \"No\"),\"No\")","v":"No"},{"$f":"IF(I865 = \"Yes\", M864/(C865+CostBuy), IF(J865 = \"Yes\", 0, K864))","v":0},null,{"$f":"IF(I865 = \"Yes\", M864-(C865+CostBuy)*K865, IF(J865=\"Yes\", M864+(C865-CostSell)*K864, M864+K865*Rate))","v":922296.93296410504}]
[null,1942.01,8.93,9.7783333333333324,9.7324999999999999,null,"No",null,{"$f":"IF(BuyAllowed=\"Yes\",IF(AND(G866 = \"No\", C866>D866), \"Yes\", \"No\"),\"No\")","v":"No"},{"$f":"IF(SellAllowed=\"Yes\",IF(AND(G866 = \"Yes\", C866<E866), \"Yes\", \"No\"),\"No\")","v":"No"},{"$f":"IF(I866 = \"Yes\", M865/(C866+CostBuy), IF(J866 = \"Yes\", 0, K865))","v":0},null,{"$f":"IF(I866 = \"Yes\", M865-(C866+CostBuy)*K866, IF(J866=\"Yes\", M865+(C866-CostSell)*K865, M865+K866*Rate))","v":922296.93296410504}]
[null,1942.02,8.65,9.5566666666666666,9.6699999999999982,null,"No",null,{"$f":"IF(BuyAllowed=\"Yes\",IF(AND(G867 = \"No\", C867>D867), \"Yes\", \"No\"),\"No\")","v":"No"},{"$f":"IF(SellAllowed=\"Yes\",IF(AND(G867 = \"Yes\", C867<E867), \"Yes\", \"No\"),\"No\")","v":"No"},{"$f":"IF(I867 = \"Yes\", M866/(C867+CostBuy), IF(J867 = \"Yes\", 0, K866))","v":0},null,{"$f":"IF(I867 = \"Yes\", M866-(C867+CostBuy)*K867, IF(J867=\"Yes\", M866+(C867-CostSell)*K866, M866+K867*Rate))","v":922296.93296410504}]
[null,1942.03,8.18,9.2966666666666651,9.53125,null,"No",null,{"$f":"IF(BuyAllowed=\"Yes\",IF(AND(G868 = \"No\", C868>D868), \"Yes\", \"No\"),\"No\")","v":"No"},{"$f":"IF(SellAllowed=\"Yes\",IF(AND(G868 = \"Yes\", C868<E868), \"Yes\", \"No\"),\"No\")","v":"No"},{"$f":"IF(I868 = \"Yes\", M867/(C868+CostBuy), IF(J868 = \"Yes\", 0, K867))","v":0},null,{"$f":"IF(I868 = \"Yes\", M867-(C868+CostBuy)*K868, IF(J868=\"Yes\", M867+(C868-CostSell)*K867, M867+K868*Rate))","v":922296.93296410504}]
[null,1942.04,7.84,8.9533333333333331,9.2712499999999984,null,"No",null,{"$f":"IF(BuyAllowed=\"Yes\",IF(AND(G869 = \"No\", C869>D869), \"Yes\", \"No\"),\"No\")","v":"No"},{"$f":"IF(SellAllowed=\"Yes\",IF(AND(G869 = \"Yes\", C869<E869), \"Yes\", \"No\"),\"No\")","v":"No"},{"$f":"IF(I869 = \"Yes\", M868/(C869+CostBuy), IF(J869 = \"Yes\", 0, K868))","v":0},null,{"$f":"IF(I869 = \"Yes\", M868-(C869+CostBuy)*K869, IF(J869=\"Yes\", M868+(C869-CostSell)*K868, M868+K869*Rate))","v":922296.93296410504}]
[null,1942.05,7.93,8.6216666666666679,8.9749999999999996,null,"No",null,{"$f":"IF(BuyAllowed=\"Yes\",IF(AND(G870 = \"No\", C870>D870), \"Yes\", \"No\"),\"No\")","v":"No"},{"$f":"IF(SellAllowed=\"Yes\",IF(AND(G870 = \"Yes\", C870<E870), \"Yes\", \"No\"),\"No\")","v":"No"},{"$f":"IF(I870 = \"Yes\", M869/(C870+CostBuy), IF(J870 = \"Yes\", 0, K869))","v":0},null,{"$f":"IF(I870 = \"Yes\", M869-(C870+CostBuy)*K870, IF(J870=\"Yes\", M869+(C870-CostSell)*K869, M869+K870*Rate))","v":922296.93296410504}]
[null,1942.06,8.33,8.3816666666666659,8.6862500000000011,null,"No",null,{"$f":"IF(BuyAllowed=\"Yes\",IF(AND(G871 = \"No\", C871>D871), \"Yes\", \"No\"),\"No\")","v":"No"},{"$f":"IF(SellAllowed=\"Yes\",IF(AND(G871 = \"Yes\", C871<E871), \"Yes\", \"No\"),\"No\")","v":"No"},{"$f":"IF(I871 = \"Yes\", M870/(C871+CostBuy), IF(J871 = \"Yes\", 0, K870))","v":0},null,{"$f":"IF(I871 = \"Yes\", M870-(C871+CostBuy)*K871, IF(J871=\"Yes\", M870+(C871-CostSell)*K870, M870+K871*Rate))","v":922296.93296410504}]
[null,1942.07,8.64,8.3099999999999987,8.4987500000000011,null,"No",null,{"$f":"IF(BuyAllowed=\"Yes\",IF(AND(G872 = \"No\", C872>D872), \"Yes\", \"No\"),\"No\")","v":"Yes"},{"$f":"IF(SellAllowed=\"Yes\",IF(AND(G872 = \"Yes\", C872<E872), \"Yes\", \"No\"),\"No\")","v":"No"},{"$f":"IF(I872 = \"Yes\", M871/(C872+CostBuy), IF(J872 = \"Yes\", 0, K871))","v":106377.96227959689},null,{"$f":"IF(I872 = \"Yes\", M871-(C872+CostBuy)*K872, IF(J872=\"Yes\", M871+(C872-CostSell)*K871, M871+K872*Rate))","v":0}]
[null,1942.08,8.59,8.2616666666666649,8.4074999999999989,null,"Yes",null,{"$f":"IF(BuyAllowed=\"Yes\",IF(AND(G873 = \"No\", C873>D873), \"Yes\", \"No\"),\"No\")","v":"No"},{"$f":"IF(SellAllowed=\"Yes\",IF(AND(G873 = \"Yes\", C873<E873), \"Yes\", \"No\"),\"No\")","v":"No"},{"$f":"IF(I873 = \"Yes\", M872/(C873+CostBuy), IF(J873 = \"Yes\", 0, K872))","v":106377.96227959689},null,{"$f":"IF(I873 = \"Yes\", M872-(C873+CostBuy)*K873, IF(J873=\"Yes\", M872+(C873-CostSell)*K872, M872+K873*Rate))","v":5318.8981139798452}]
[null,1942.09,8.68,8.2516666666666669,8.3862499999999986,null,"Yes",null,{"$f":"IF(BuyAllowed=\"Yes\",IF(AND(G874 = \"No\", C874>D874), \"Yes\", \"No\"),\"No\")","v":"No"},{"$f":"IF(SellAllowed=\"Yes\",IF(AND(G874 = \"Yes\", C874<E874), \"Yes\", \"No\"),\"No\")","v":"No"},{"$f":"IF(I874 = \"Yes\", M873/(C874+CostBuy), IF(J874 = \"Yes\", 0, K873))","v":106377.96227959689},null,{"$f":"IF(I874 = \"Yes\", M873-(C874+CostBuy)*K874, IF(J874=\"Yes\", M873+(C874-CostSell)*K873, M873+K874*Rate))","v":10637.79622795969}]
[null,1942.1,9.32,8.3349999999999991,8.3550000000000004,null,"Yes",null,{"$f":"IF(BuyAllowed=\"Yes\",IF(AND(G875 = \"No\", C875>D875), \"Yes\", \"No\"),\"No\")","v":"No"},{"$f":"IF(SellAllowed=\"Yes\",IF(AND(G875 = \"Yes\", C875<E875), \"Yes\", \"No\"),\"No\")","v":"No"},{"$f":"IF(I875 = \"Yes\", M874/(C875+CostBuy), IF(J875 = \"Yes\", 0, K874))","v":106377.96227959689},null,{"$f":"IF(I875 = \"Yes\", M874-(C875+CostBuy)*K875, IF(J875=\"Yes\", M874+(C875-CostSell)*K874, M874+K875*Rate))","v":15956.694341939536}]
[null,1942.11,9.4700000000000006,8.5816666666666652,8.4387500000000006,null,"Yes",null,{"$f":"IF(BuyAllowed=\"Yes\",IF(AND(G876 = \"No\", C876>D876), \"Yes\", \"No\"),\"No\")","v":"No"},{"$f":"IF(SellAllowed=\"Yes\",IF(AND(G876 = \"Yes\", C876<E876), \"Yes\", \"No\"),\"No\")","v":"No"},{"$f":"IF(I876 = \"Yes\", M875/(C876+CostBuy), IF(J876 = \"Yes\", 0, K875))","v":106377.96227959689},null,{"$f":"IF(I876 = \"Yes\", M875-(C876+CostBuy)*K876, IF(J876=\"Yes\", M875+(C876-CostSell)*K875, M875+K876*Rate))","v":21275.592455919381}]
[null,1942.12,9.52,8.8383333333333329,8.6,null,"Yes",null,{"$f":"IF(BuyAllowed=\"Yes\",IF(AND(G877 = \"No\", C877>D877), \"Yes\", \"No\"),\"No\")","v":"No"},{"$f":"IF(SellAllowed=\"Yes\",IF(AND(G877 = \"Yes\", C877<E877), \"Yes\", \"No\"),\"No\")","v":"No"},{"$f":"IF(I877 = \"Yes\", M876/(C877+CostBuy), IF(J877 = \"Yes\", 0, K876))","v":106377.96227959689},null,{"$f":"IF(I877 = \"Yes\", M876-(C877+CostBuy)*K877, IF(J877=\"Yes\", M876+(C877-CostSell)*K876, M876+K877*Rate))","v":26594.490569899226}]
[null,1943.01,10.09,9.0366666666666671,8.8099999999999987,null,"Yes",null,{"$f":"IF(BuyAllowed=\"Yes\",IF(AND(G878 = \"No\", C878>D878), \"Yes\", \"No\"),\"No\")","v":"No"},{"$f":"IF(SellAllowed=\"Yes\",IF(AND(G878 = \"Yes\", C878<E878), \"Yes\", \"No\"),\"No\")","v":"No"},{"$f":"IF(I878 = \"Yes\", M877/(C878+CostBuy), IF(J878 = \"Yes\", 0, K877))","v":106377.96227959689},null,{"$f":"IF(I878 = \"Yes\", M877-(C878+CostBuy)*K878, IF(J878=\"Yes\", M877+(C878-CostSell)*K877, M877+K878*Rate))","v":31913.388683879071}]
[null,1943.02,10.69,9.2783333333333342,9.08,null,"Yes",null,{"$f":"IF(BuyAllowed=\"Yes\",IF(AND(G879 = \"No\", C879>D879), \"Yes\", \"No\"),\"No\")","v":"No"},{"$f":"IF(SellAllowed=\"Yes\",IF(AND(G879 = \"Yes\", C879<E879), \"Yes\", \"No\"),\"No\")","v":"No"},{"$f":"IF(I879 = \"Yes\", M878/(C879+CostBuy), IF(J879 = \"Yes\", 0, K878))","v":106377.96227959689},null,{"$f":"IF(I879 = \"Yes\", M878-(C879+CostBuy)*K879, IF(J879=\"Yes\", M878+(C879-CostSell)*K878, M878+K879*Rate))","v":37232.28679785892}]
[null,1943.03,11.07,9.6283333333333321,9.375,null,"Yes",null,{"$f":"IF(BuyAllowed=\"Yes\",IF(AND(G880 = \"No\", C880>D880), \"Yes\", \"No\"),\"No\")","v":"No"},{"$f":"IF(SellAllowed=\"Yes\",IF(AND(G880 = \"Yes\", C880<E880), \"Yes\", \"No\"),\"No\")","v":"No"},{"$f":"IF(I880 = \"Yes\", M879/(C880+CostBuy), IF(J880 = \"Yes\", 0, K879))","v":106377.96227959689},null,{"$f":"IF(I880 = \"Yes\", M879-(C880+CostBuy)*K880, IF(J880=\"Yes\", M879+(C880-CostSell)*K879, M879+K880*Rate))","v":42551.184911838762}]
[null,1943.04,11.44,10.026666666666666,9.6787500000000009,null,"Yes",null,{"$f":"IF(BuyAllowed=\"Yes\",IF(AND(G881 = \"No\", C881>D881), \"Yes\", \"No\"),\"No\")","v":"No"},{"$f":"IF(SellAllowed=\"Yes\",IF(AND(G881 = \"Yes\", C881<E881), \"Yes\", \"No\"),\"No\")","v":"No"},{"$f":"IF(I881 = \"Yes\", M880/(C881+CostBuy), IF(J881 = \"Yes\", 0, K880))","v":106377.96227959689},null,{"$f":"IF(I881 = \"Yes\", M880-(C881+CostBuy)*K881, IF(J881=\"Yes\", M880+(C881-CostSell)*K880, M880+K881*Rate))","v":47870.083025818603}]
[null,1943.05,11.89,10.38,10.035,null,"Yes",null,{"$f":"IF(BuyAllowed=\"Yes\",IF(AND(G882 = \"No\", C882>D882), \"Yes\", \"No\"),\"No\")","v":"No"},{"$f":"IF(SellAllowed=\"Yes\",IF(AND(G882 = \"Yes\", C882<E882), \"Yes\", \"No\"),\"No\")","v":"No"},{"$f":"IF(I882 = \"Yes\", M881/(C882+CostBuy), IF(J882 = \"Yes\", 0, K881))","v":106377.96227959689},null,{"$f":"IF(I882 = \"Yes\", M881-(C882+CostBuy)*K882, IF(J882=\"Yes\", M881+(C882-CostSell)*K881, M881+K882*Rate))","v":53188.981139798445}]
[null,1943.06,12.1,10.783333333333331,10.436249999999999,null,"Yes",null,{"$f":"IF(BuyAllowed=\"Yes\",IF(AND(G883 = \"No\", C883>D883), \"Yes\", \"No\"),\"No\")","v":"No"},{"$f":"IF(SellAllowed=\"Yes\",IF(AND(G883 = \"Yes\", C883<E883), \"Yes\", \"No\"),\"No\")","v":"No"},{"$f":"IF(I883 = \"Yes\", M882/(C883+CostBuy), IF(J883 = \"Yes\", 0, K882))","v":106377.96227959689},null,{"$f":"IF(I883 = \"Yes\", M882-(C883+CostBuy)*K883, IF(J883=\"Yes\", M882+(C883-CostSell)*K882, M882+K883*Rate))","v":58507.879253778287}]
[null,1943.07,12.35,11.213333333333333,10.78375,null,"Yes",null,{"$f":"IF(BuyAllowed=\"Yes\",IF(AND(G884 = \"No\", C884>D884), \"Yes\", \"No\"),\"No\")","v":"No"},{"$f":"IF(SellAllowed=\"Yes\",IF(AND(G884 = \"Yes\", C884<E884), \"Yes\", \"No\"),\"No\")","v":"No"},{"$f":"IF(I884 = \"Yes\", M883/(C884+CostBuy), IF(J884 = \"Yes\", 0, K883))","v":106377.96227959689},null,{"$f":"IF(I884 = \"Yes\", M883-(C884+CostBuy)*K884, IF(J884=\"Yes\", M883+(C884-CostSell)*K883, M883+K884*Rate))","v":63826.777367758128}]
[null,1943.08,11.74,11.589999999999998,11.143749999999997,null,"Yes",null,{"$f":"IF(BuyAllowed=\"Yes\",IF(AND(G885 = \"No\", C885>D885), \"Yes\", \"No\"),\"No\")","v":"No"},{"$f":"IF(SellAllowed=\"Yes\",IF(AND(G885 = \"Yes\", C885<E885), \"Yes\", \"No\"),\"No\")","v":"No"},{"$f":"IF(I885 = \"Yes\", M884/(C885+CostBuy), IF(J885 = \"Yes\", 0, K884))","v":106377.96227959689},null,{"$f":"IF(I885 = \"Yes\", M884-(C885+CostBuy)*K885, IF(J885=\"Yes\", M884+(C885-CostSell)*K884, M884+K885*Rate))","v":69145.67548173797}]
[null,1943.09,11.99,11.765000000000001,11.421249999999999,null,"Yes",null,{"$f":"IF(BuyAllowed=\"Yes\",IF(AND(G886 = \"No\", C886>D886), \"Yes\", \"No\"),\"No\")","v":"No"},{"$f":"IF(SellAllowed=\"Yes\",IF(AND(G886 = \"Yes\", C886<E886), \"Yes\", \"No\"),\"No\")","v":"No"},{"$f":"IF(I886 = \"Yes\", M885/(C886+CostBuy), IF(J886 = \"Yes\", 0, K885))","v":106377.96227959689},null,{"$f":"IF(I886 = \"Yes\", M885-(C886+CostBuy)*K886, IF(J886=\"Yes\", M885+(C886-CostSell)*K885, M885+K886*Rate))","v":74464.573595717811}]
[null,1943.1,11.88,11.918333333333335,11.658749999999998,null,"Yes",null,{"$f":"IF(BuyAllowed=\"Yes\",IF(AND(G887 = \"No\", C887>D887), \"Yes\", \"No\"),\"No\")","v":"No"},{"$f":"IF(SellAllowed=\"Yes\",IF(AND(G887 = \"Yes\", C887<E887), \"Yes\", \"No\"),\"No\")","v":"No"},{"$f":"IF(I887 = \"Yes\", M886/(C887+CostBuy), IF(J887 = \"Yes\", 0, K886))","v":106377.96227959689},null,{"$f":"IF(I887 = \"Yes\", M886-(C887+CostBuy)*K887, IF(J887=\"Yes\", M886+(C887-CostSell)*K886, M886+K887*Rate))","v":79783.471709697653}]
[null,1943.11,11.33,11.991666666666667,11.807499999999999,null,"Yes",null,{"$f":"IF(BuyAllowed=\"Yes\",IF(AND(G888 = \"No\", C888>D888), \"Yes\", \"No\"),\"No\")","v":"No"},{"$f":"IF(SellAllowed=\"Yes\",IF(AND(G888 = \"Yes\", C888<E888), \"Yes\", \"No\"),\"No\")","v":"Yes"},{"$f":"IF(I888 = \"Yes\", M887/(C888+CostBuy), IF(J888 = \"Yes\", 0, K887))","v":0},null,{"$f":"IF(I888 = \"Yes\", M887-(C888+CostBuy)*K888, IF(J888=\"Yes\", M887+(C888-CostSell)*K887, M887+K888*Rate))","v":1278663.1066007547}]
[null,1943.12,11.48,11.898333333333333,11.84,null,"No",null,{"$f":"IF(BuyAllowed=\"Yes\",IF(AND(G889 = \"No\", C889>D889), \"Yes\", \"No\"),\"No\")","v":"No"},{"$f":"IF(SellAllowed=\"Yes\",IF(AND(G889 = \"Yes\", C889<E889), \"Yes\", \"No\"),\"No\")","v":"No"},{"$f":"IF(I889 = \"Yes\", M888/(C889+CostBuy), IF(J889 = \"Yes\", 0, K888))","v":0},null,{"$f":"IF(I889 = \"Yes\", M888-(C889+CostBuy)*K889, IF(J889=\"Yes\", M888+(C889-CostSell)*K888, M888+K889*Rate))","v":1278663.1066007547}]
[null,1944.01,11.85,11.795,11.845000000000001,null,"No",null,{"$f":"IF(BuyAllowed=\"Yes\",IF(AND(G890 = \"No\", C890>D890), \"Yes\", \"No\"),\"No\")","v":"Yes"},{"$f":"IF(SellAllowed=\"Yes\",IF(AND(G890 = \"Yes\", C890<E890), \"Yes\", \"No\"),\"No\")","v":"No"},{"$f":"IF(I890 = \"Yes\", M889/(C890+CostBuy), IF(J890 = \"Yes\", 0, K889))","v":107631.57462969316},null,{"$f":"IF(I890 = \"Yes\", M889-(C890+CostBuy)*K890, IF(J890=\"Yes\", M889+(C890-CostSell)*K889, M889+K890*Rate))","v":0}]
[null,1944.02,11.77,11.711666666666666,11.84,null,"Yes",null,{"$f":"IF(BuyAllowed=\"Yes\",IF(AND(G891 = \"No\", C891>D891), \"Yes\", \"No\"),\"No\")","v":"No"},{"$f":"IF(SellAllowed=\"Yes\",IF(AND(G891 = \"Yes\", C891<E891), \"Yes\", \"No\"),\"No\")","v":"Yes"},{"$f":"IF(I891 = \"Yes\", M890/(C891+CostBuy), IF(J891 = \"Yes\", 0, K890))","v":0},null,{"$f":"IF(I891 = \"Yes\", M890-(C891+CostBuy)*K891, IF(J891=\"Yes\", M890+(C891-CostSell)*K890, M890+K891*Rate))","v":1260365.7389137067}]
[null,1944.03,12.1,11.716666666666669,11.798749999999998,null,"No",null,{"$f":"IF(BuyAllowed=\"Yes\",IF(AND(G892 = \"No\", C892>D892), \"Yes\", \"No\"),\"No\")","v":"Yes"},{"$f":"IF(SellAllowed=\"Yes\",IF(AND(G892 = \"Yes\", C892<E892), \"Yes\", \"No\"),\"No\")","v":"No"},{"$f":"IF(I892 = \"Yes\", M891/(C892+CostBuy), IF(J892 = \"Yes\", 0, K891))","v":103904.84244960485},null,{"$f":"IF(I892 = \"Yes\", M891-(C892+CostBuy)*K892, IF(J892=\"Yes\", M891+(C892-CostSell)*K891, M891+K892*Rate))","v":0}]
[null,1944.04,11.89,11.734999999999999,11.767499999999998,null,"Yes",null,{"$f":"IF(BuyAllowed=\"Yes\",IF(AND(G893 = \"No\", C893>D893), \"Yes\", \"No\"),\"No\")","v":"No"},{"$f":"IF(SellAllowed=\"Yes\",IF(AND(G893 = \"Yes\", C893<E893), \"Yes\", \"No\"),\"No\")","v":"No"},{"$f":"IF(I893 = \"Yes\", M892/(C893+CostBuy), IF(J893 = \"Yes\", 0, K892))","v":103904.84244960485},null,{"$f":"IF(I893 = \"Yes\", M892-(C893+CostBuy)*K893, IF(J893=\"Yes\", M892+(C893-CostSell)*K892, M892+K893*Rate))","v":5195.2421224802429}]
[null,1944.05,12.1,11.73666666666667,11.786250000000001,null,"Yes",null,{"$f":"IF(BuyAllowed=\"Yes\",IF(AND(G894 = \"No\", C894>D894), \"Yes\", \"No\"),\"No\")","v":"No"},{"$f":"IF(SellAllowed=\"Yes\",IF(AND(G894 = \"Yes\", C894<E894), \"Yes\", \"No\"),\"No\")","v":"No"},{"$f":"IF(I894 = \"Yes\", M893/(C894+CostBuy), IF(J894 = \"Yes\", 0, K893))","v":103904.84244960485},null,{"$f":"IF(I894 = \"Yes\", M893-(C894+CostBuy)*K894, IF(J894=\"Yes\", M893+(C894-CostSell)*K893, M893+K894*Rate))","v":10390.484244960486}]
[null,1944.06,12.67,11.865,11.799999999999999,null,"Yes",null,{"$f":"IF(BuyAllowed=\"Yes\",IF(AND(G895 = \"No\", C895>D895), \"Yes\", \"No\"),\"No\")","v":"No"},{"$f":"IF(SellAllowed=\"Yes\",IF(AND(G895 = \"Yes\", C895<E895), \"Yes\", \"No\"),\"No\")","v":"No"},{"$f":"IF(I895 = \"Yes\", M894/(C895+CostBuy), IF(J895 = \"Yes\", 0, K894))","v":103904.84244960485},null,{"$f":"IF(I895 = \"Yes\", M894-(C895+CostBuy)*K895, IF(J895=\"Yes\", M894+(C895-CostSell)*K894, M894+K895*Rate))","v":15585.72636744073}]
[null,1944.07,13,12.063333333333333,11.898750000000001,null,"Yes",null,{"$f":"IF(BuyAllowed=\"Yes\",IF(AND(G896 = \"No\", C896>D896), \"Yes\", \"No\"),\"No\")","v":"No"},{"$f":"IF(SellAllowed=\"Yes\",IF(AND(G896 = \"Yes\", C896<E896), \"Yes\", \"No\"),\"No\")","v":"No"},{"$f":"IF(I896 = \"Yes\", M895/(C896+CostBuy), IF(J896 = \"Yes\", 0, K895))","v":103904.84244960485},null,{"$f":"IF(I896 = \"Yes\", M895-(C896+CostBuy)*K896, IF(J896=\"Yes\", M895+(C896-CostSell)*K895, M895+K896*Rate))","v":20780.968489920971}]
[null,1944.08,12.81,12.255000000000001,12.1075,null,"Yes",null,{"$f":"IF(BuyAllowed=\"Yes\",IF(AND(G897 = \"No\", C897>D897), \"Yes\", \"No\"),\"No\")","v":"No"},{"$f":"IF(SellAllowed=\"Yes\",IF(AND(G897 = \"Yes\", C897<E897), \"Yes\", \"No\"),\"No\")","v":"No"},{"$f":"IF(I897 = \"Yes\", M896/(C897+CostBuy), IF(J897 = \"Yes\", 0, K896))","v":103904.84244960485},null,{"$f":"IF(I897 = \"Yes\", M896-(C897+CostBuy)*K897, IF(J897=\"Yes\", M896+(C897-CostSell)*K896, M896+K897*Rate))","v":25976.210612401213}]
[null,1944.09,12.6,12.428333333333335,12.27375,null,"Yes",null,{"$f":"IF(BuyAllowed=\"Yes\",IF(AND(G898 = \"No\", C898>D898), \"Yes\", \"No\"),\"No\")","v":"No"},{"$f":"IF(SellAllowed=\"Yes\",IF(AND(G898 = \"Yes\", C898<E898), \"Yes\", \"No\"),\"No\")","v":"No"},{"$f":"IF(I898 = \"Yes\", M897/(C898+CostBuy), IF(J898 = \"Yes\", 0, K897))","v":103904.84244960485},null,{"$f":"IF(I898 = \"Yes\", M897-(C898+CostBuy)*K898, IF(J898=\"Yes\", M897+(C898-CostSell)*K897, M897+K898*Rate))","v":31171.452734881455}]
[null,1944.1,12.91,12.511666666666668,12.3675,null,"Yes",null,{"$f":"IF(BuyAllowed=\"Yes\",IF(AND(G899 = \"No\", C899>D899), \"Yes\", \"No\"),\"No\")","v":"No"},{"$f":"IF(SellAllowed=\"Yes\",IF(AND(G899 = \"Yes\", C899<E899), \"Yes\", \"No\"),\"No\")","v":"No"},{"$f":"IF(I899 = \"Yes\", M898/(C899+CostBuy), IF(J899 = \"Yes\", 0, K898))","v":103904.84244960485},null,{"$f":"IF(I899 = \"Yes\", M898-(C899+CostBuy)*K899, IF(J899=\"Yes\", M898+(C899-CostSell)*K898, M898+K899*Rate))","v":36366.694857361697}]
[null,1944.11,12.82,12.681666666666667,12.51,null,"Yes",null,{"$f":"IF(BuyAllowed=\"Yes\",IF(AND(G900 = \"No\", C900>D900), \"Yes\", \"No\"),\"No\")","v":"No"},{"$f":"IF(SellAllowed=\"Yes\",IF(AND(G900 = \"Yes\", C900<E900), \"Yes\", \"No\"),\"No\")","v":"No"},{"$f":"IF(I900 = \"Yes\", M899/(C900+CostBuy), IF(J900 = \"Yes\", 0, K899))","v":103904.84244960485},null,{"$f":"IF(I900 = \"Yes\", M899-(C900+CostBuy)*K900, IF(J900=\"Yes\", M899+(C900-CostSell)*K899, M899+K900*Rate))","v":41561.936979841943}]
[null,1944.12,13.1,12.801666666666668,12.600000000000001,null,"Yes",null,{"$f":"IF(BuyAllowed=\"Yes\",IF(AND(G901 = \"No\", C901>D901), \"Yes\", \"No\"),\"No\")","v":"No"},{"$f":"IF(SellAllowed=\"Yes\",IF(AND(G901 = \"Yes\", C901<E901), \"Yes\", \"No\"),\"No\")","v":"No"},{"$f":"IF(I901 = \"Yes\", M900/(C901+CostBuy), IF(J901 = \"Yes\", 0, K900))","v":103904.84244960485},null,{"$f":"IF(I901 = \"Yes\", M900-(C901+CostBuy)*K901, IF(J901=\"Yes\", M900+(C901-CostSell)*K900, M900+K901*Rate))","v":46757.179102322189}]
[null,1945.01,13.49,12.873333333333335,12.751249999999999,null,"Yes",null,{"$f":"IF(BuyAllowed=\"Yes\",IF(AND(G902 = \"No\", C902>D902), \"Yes\", \"No\"),\"No\")","v":"No"},{"$f":"IF(SellAllowed=\"Yes\",IF(AND(G902 = \"Yes\", C902<E902), \"Yes\", \"No\"),\"No\")","v":"No"},{"$f":"IF(I902 = \"Yes\", M901/(C902+CostBuy), IF(J902 = \"Yes\", 0, K901))","v":103904.84244960485},null,{"$f":"IF(I902 = \"Yes\", M901-(C902+CostBuy)*K902, IF(J902=\"Yes\", M901+(C902-CostSell)*K901, M901+K902*Rate))","v":51952.421224802434}]
[null,1945.02,13.94,12.954999999999998,12.924999999999999,null,"Yes",null,{"$f":"IF(BuyAllowed=\"Yes\",IF(AND(G903 = \"No\", C903>D903), \"Yes\", \"No\"),\"No\")","v":"No"},{"$f":"IF(SellAllowed=\"Yes\",IF(AND(G903 = \"Yes\", C903<E903), \"Yes\", \"No\"),\"No\")","v":"No"},{"$f":"IF(I903 = \"Yes\", M902/(C903+CostBuy), IF(J903 = \"Yes\", 0, K902))","v":103904.84244960485},null,{"$f":"IF(I903 = \"Yes\", M902-(C903+CostBuy)*K903, IF(J903=\"Yes\", M902+(C903-CostSell)*K902, M902+K903*Rate))","v":57147.66334728268}]
[null,1945.03,13.93,13.143333333333333,13.08375,null,"Yes",null,{"$f":"IF(BuyAllowed=\"Yes\",IF(AND(G904 = \"No\", C904>D904), \"Yes\", \"No\"),\"No\")","v":"No"},{"$f":"IF(SellAllowed=\"Yes\",IF(AND(G904 = \"Yes\", C904<E904), \"Yes\", \"No\"),\"No\")","v":"No"},{"$f":"IF(I904 = \"Yes\", M903/(C904+CostBuy), IF(J904 = \"Yes\", 0, K903))","v":103904.84244960485},null,{"$f":"IF(I904 = \"Yes\", M903-(C904+CostBuy)*K904, IF(J904=\"Yes\", M903+(C904-CostSell)*K903, M903+K904*Rate))","v":62342.905469762925}]
[null,1945.04,14.28,13.365,13.2,null,"Yes",null,{"$f":"IF(BuyAllowed=\"Yes\",IF(AND(G905 = \"No\", C905>D905), \"Yes\", \"No\"),\"No\")","v":"No"},{"$f":"IF(SellAllowed=\"Yes\",IF(AND(G905 = \"Yes\", C905<E905), \"Yes\", \"No\"),\"No\")","v":"No"},{"$f":"IF(I905 = \"Yes\", M904/(C905+CostBuy), IF(J905 = \"Yes\", 0, K904))","v":103904.84244960485},null,{"$f":"IF(I905 = \"Yes\", M904-(C905+CostBuy)*K905, IF(J905=\"Yes\", M904+(C905-CostSell)*K904, M904+K905*Rate))","v":67538.147592243171}]
[null,1945.05,14.82,13.593333333333334,13.383749999999999,null,"Yes",null,{"$f":"IF(BuyAllowed=\"Yes\",IF(AND(G906 = \"No\", C906>D906), \"Yes\", \"No\"),\"No\")","v":"No"},{"$f":"IF(SellAllowed=\"Yes\",IF(AND(G906 = \"Yes\", C906<E906), \"Yes\", \"No\"),\"No\")","v":"No"},{"$f":"IF(I906 = \"Yes\", M905/(C906+CostBuy), IF(J906 = \"Yes\", 0, K905))","v":103904.84244960485},null,{"$f":"IF(I906 = \"Yes\", M905-(C906+CostBuy)*K906, IF(J906=\"Yes\", M905+(C906-CostSell)*K905, M905+K906*Rate))","v":72733.389714723409}]
[null,1945.06,15.09,13.926666666666668,13.661249999999999,null,"Yes",null,{"$f":"IF(BuyAllowed=\"Yes\",IF(AND(G907 = \"No\", C907>D907), \"Yes\", \"No\"),\"No\")","v":"No"},{"$f":"IF(SellAllowed=\"Yes\",IF(AND(G907 = \"Yes\", C907<E907), \"Yes\", \"No\"),\"No\")","v":"No"},{"$f":"IF(I907 = \"Yes\", M906/(C907+CostBuy), IF(J907 = \"Yes\", 0, K906))","v":103904.84244960485},null,{"$f":"IF(I907 = \"Yes\", M906-(C907+CostBuy)*K907, IF(J907=\"Yes\", M906+(C907-CostSell)*K906, M906+K907*Rate))","v":77928.631837203648}]
[null,1945.07,14.78,14.258333333333335,13.93375,null,"Yes",null,{"$f":"IF(BuyAllowed=\"Yes\",IF(AND(G908 = \"No\", C908>D908), \"Yes\", \"No\"),\"No\")","v":"No"},{"$f":"IF(SellAllowed=\"Yes\",IF(AND(G908 = \"Yes\", C908<E908), \"Yes\", \"No\"),\"No\")","v":"No"},{"$f":"IF(I908 = \"Yes\", M907/(C908+CostBuy), IF(J908 = \"Yes\", 0, K907))","v":103904.84244960485},null,{"$f":"IF(I908 = \"Yes\", M907-(C908+CostBuy)*K908, IF(J908=\"Yes\", M907+(C908-CostSell)*K907, M907+K908*Rate))","v":83123.873959683886}]
[null,1945.08,14.83,14.473333333333334,14.178750000000001,null,"Yes",null,{"$f":"IF(BuyAllowed=\"Yes\",IF(AND(G909 = \"No\", C909>D909), \"Yes\", \"No\"),\"No\")","v":"No"},{"$f":"IF(SellAllowed=\"Yes\",IF(AND(G909 = \"Yes\", C909<E909), \"Yes\", \"No\"),\"No\")","v":"No"},{"$f":"IF(I909 = \"Yes\", M908/(C909+CostBuy), IF(J909 = \"Yes\", 0, K908))","v":103904.84244960485},null,{"$f":"IF(I909 = \"Yes\", M908-(C909+CostBuy)*K909, IF(J909=\"Yes\", M908+(C909-CostSell)*K908, M908+K909*Rate))","v":88319.116082164124}]
[null,1945.09,15.84,14.621666666666668,14.395000000000001,null,"Yes",null,{"$f":"IF(BuyAllowed=\"Yes\",IF(AND(G910 = \"No\", C910>D910), \"Yes\", \"No\"),\"No\")","v":"No"},{"$f":"IF(SellAllowed=\"Yes\",IF(AND(G910 = \"Yes\", C910<E910), \"Yes\", \"No\"),\"No\")","v":"No"},{"$f":"IF(I910 = \"Yes\", M909/(C910+CostBuy), IF(J910 = \"Yes\", 0, K909))","v":103904.84244960485},null,{"$f":"IF(I910 = \"Yes\", M909-(C910+CostBuy)*K910, IF(J910=\"Yes\", M909+(C910-CostSell)*K909, M909+K910*Rate))","v":93514.358204644363}]
[null,1945.1,16.5,14.94,14.688750000000001,null,"Yes",null,{"$f":"IF(BuyAllowed=\"Yes\",IF(AND(G911 = \"No\", C911>D911), \"Yes\", \"No\"),\"No\")","v":"No"},{"$f":"IF(SellAllowed=\"Yes\",IF(AND(G911 = \"Yes\", C911<E911), \"Yes\", \"No\"),\"No\")","v":"No"},{"$f":"IF(I911 = \"Yes\", M910/(C911+CostBuy), IF(J911 = \"Yes\", 0, K910))","v":103904.84244960485},null,{"$f":"IF(I911 = \"Yes\", M910-(C911+CostBuy)*K911, IF(J911=\"Yes\", M910+(C911-CostSell)*K910, M910+K911*Rate))","v":98709.600327124601}]
[null,1945.11,17.04,15.31,15.008750000000001,null,"Yes",null,{"$f":"IF(BuyAllowed=\"Yes\",IF(AND(G912 = \"No\", C912>D912), \"Yes\", \"No\"),\"No\")","v":"No"},{"$f":"IF(SellAllowed=\"Yes\",IF(AND(G912 = \"Yes\", C912<E912), \"Yes\", \"No\"),\"No\")","v":"No"},{"$f":"IF(I912 = \"Yes\", M911/(C912+CostBuy), IF(J912 = \"Yes\", 0, K911))","v":103904.84244960485},null,{"$f":"IF(I912 = \"Yes\", M911-(C912+CostBuy)*K912, IF(J912=\"Yes\", M911+(C912-CostSell)*K911, M911+K912*Rate))","v":103904.84244960484}]
[null,1945.12,17.329999999999998,15.679999999999998,15.397500000000001,null,"Yes",null,{"$f":"IF(BuyAllowed=\"Yes\",IF(AND(G913 = \"No\", C913>D913), \"Yes\", \"No\"),\"No\")","v":"No"},{"$f":"IF(SellAllowed=\"Yes\",IF(AND(G913 = \"Yes\", C913<E913), \"Yes\", \"No\"),\"No\")","v":"No"},{"$f":"IF(I913 = \"Yes\", M912/(C913+CostBuy), IF(J913 = \"Yes\", 0, K912))","v":103904.84244960485},null,{"$f":"IF(I913 = \"Yes\", M912-(C913+CostBuy)*K913, IF(J913=\"Yes\", M912+(C913-CostSell)*K912, M912+K913*Rate))","v":109100.08457208508}]
[null,1946.01,18.02,16.053333333333335,15.77875,null,"Yes",null,{"$f":"IF(BuyAllowed=\"Yes\",IF(AND(G914 = \"No\", C914>D914), \"Yes\", \"No\"),\"No\")","v":"No"},{"$f":"IF(SellAllowed=\"Yes\",IF(AND(G914 = \"Yes\", C914<E914), \"Yes\", \"No\"),\"No\")","v":"No"},{"$f":"IF(I914 = \"Yes\", M913/(C914+CostBuy), IF(J914 = \"Yes\", 0, K913))","v":103904.84244960485},null,{"$f":"IF(I914 = \"Yes\", M913-(C914+CostBuy)*K914, IF(J914=\"Yes\", M913+(C914-CostSell)*K913, M913+K914*Rate))","v":114295.32669456532}]
[null,1946.02,18.07,16.593333333333334,16.178749999999997,null,"Yes",null,{"$f":"IF(BuyAllowed=\"Yes\",IF(AND(G915 = \"No\", C915>D915), \"Yes\", \"No\"),\"No\")","v":"No"},{"$f":"IF(SellAllowed=\"Yes\",IF(AND(G915 = \"Yes\", C915<E915), \"Yes\", \"No\"),\"No\")","v":"No"},{"$f":"IF(I915 = \"Yes\", M914/(C915+CostBuy), IF(J915 = \"Yes\", 0, K914))","v":103904.84244960485},null,{"$f":"IF(I915 = \"Yes\", M914-(C915+CostBuy)*K915, IF(J915=\"Yes\", M914+(C915-CostSell)*K914, M914+K915*Rate))","v":119490.56881704555}]
[null,1946.03,17.53,17.133333333333336,16.55125,null,"Yes",null,{"$f":"IF(BuyAllowed=\"Yes\",IF(AND(G916 = \"No\", C916>D916), \"Yes\", \"No\"),\"No\")","v":"No"},{"$f":"IF(SellAllowed=\"Yes\",IF(AND(G916 = \"Yes\", C916<E916), \"Yes\", \"No\"),\"No\")","v":"No"},{"$f":"IF(I916 = \"Yes\", M915/(C916+CostBuy), IF(J916 = \"Yes\", 0, K915))","v":103904.84244960485},null,{"$f":"IF(I916 = \"Yes\", M915-(C916+CostBuy)*K916, IF(J916=\"Yes\", M915+(C916-CostSell)*K915, M915+K916*Rate))","v":124685.81093952579}]
[null,1946.04,18.66,17.415000000000003,16.895,null,"Yes",null,{"$f":"IF(BuyAllowed=\"Yes\",IF(AND(G917 = \"No\", C917>D917), \"Yes\", \"No\"),\"No\")","v":"No"},{"$f":"IF(SellAllowed=\"Yes\",IF(AND(G917 = \"Yes\", C917<E917), \"Yes\", \"No\"),\"No\")","v":"No"},{"$f":"IF(I917 = \"Yes\", M916/(C917+CostBuy), IF(J917 = \"Yes\", 0, K916))","v":103904.84244960485},null,{"$f":"IF(I917 = \"Yes\", M916-(C917+CostBuy)*K917, IF(J917=\"Yes\", M916+(C917-CostSell)*K916, M916+K917*Rate))","v":129881.05306200603}]
[null,1946.05,18.7,17.775000000000002,17.373750000000001,null,"Yes",null,{"$f":"IF(BuyAllowed=\"Yes\",IF(AND(G918 = \"No\", C918>D918), \"Yes\", \"No\"),\"No\")","v":"No"},{"$f":"IF(SellAllowed=\"Yes\",IF(AND(G918 = \"Yes\", C918<E918), \"Yes\", \"No\"),\"No\")","v":"No"},{"$f":"IF(I918 = \"Yes\", M917/(C918+CostBuy), IF(J918 = \"Yes\", 0, K917))","v":103904.84244960485},null,{"$f":"IF(I918 = \"Yes\", M917-(C918+CostBuy)*K918, IF(J918=\"Yes\", M917+(C918-CostSell)*K917, M917+K918*Rate))","v":135076.29518448628}]
[null,1946.06,18.579999999999998,18.051666666666666,17.731249999999999,null,"Yes",null,{"$f":"IF(BuyAllowed=\"Yes\",IF(AND(G919 = \"No\", C919>D919), \"Yes\", \"No\"),\"No\")","v":"No"},{"$f":"IF(SellAllowed=\"Yes\",IF(AND(G919 = \"Yes\", C919<E919), \"Yes\", \"No\"),\"No\")","v":"No"},{"$f":"IF(I919 = \"Yes\", M918/(C919+CostBuy), IF(J919 = \"Yes\", 0, K918))","v":103904.84244960485},null,{"$f":"IF(I919 = \"Yes\", M918-(C919+CostBuy)*K919, IF(J919=\"Yes\", M918+(C919-CostSell)*K918, M918+K919*Rate))","v":140271.53730696652}]
[null,1946.07,18.05,18.260000000000002,17.991250000000001,null,"Yes",null,{"$f":"IF(BuyAllowed=\"Yes\",IF(AND(G920 = \"No\", C920>D920), \"Yes\", \"No\"),\"No\")","v":"No"},{"$f":"IF(SellAllowed=\"Yes\",IF(AND(G920 = \"Yes\", C920<E920), \"Yes\", \"No\"),\"No\")","v":"No"},{"$f":"IF(I920 = \"Yes\", M919/(C920+CostBuy), IF(J920 = \"Yes\", 0, K919))","v":103904.84244960485},null,{"$f":"IF(I920 = \"Yes\", M919-(C920+CostBuy)*K920, IF(J920=\"Yes\", M919+(C920-CostSell)*K919, M919+K920*Rate))","v":145466.77942944676}]
[null,1946.08,17.7,18.265000000000001,18.1175,null,"Yes",null,{"$f":"IF(BuyAllowed=\"Yes\",IF(AND(G921 = \"No\", C921>D921), \"Yes\", \"No\"),\"No\")","v":"No"},{"$f":"IF(SellAllowed=\"Yes\",IF(AND(G921 = \"Yes\", C921<E921), \"Yes\", \"No\"),\"No\")","v":"Yes"},{"$f":"IF(I921 = \"Yes\", M920/(C921+CostBuy), IF(J921 = \"Yes\", 0, K920))","v":0},null,{"$f":"IF(I921 = \"Yes\", M920-(C921+CostBuy)*K921, IF(J921=\"Yes\", M920+(C921-CostSell)*K920, M920+K921*Rate))","v":1978348.2002404763}]
[null,1946.09,15.09,18.203333333333333,18.16375,null,"No",null,{"$f":"IF(BuyAllowed=\"Yes\",IF(AND(G922 = \"No\", C922>D922), \"Yes\", \"No\"),\"No\")","v":"No"},{"$f":"IF(SellAllowed=\"Yes\",IF(AND(G922 = \"Yes\", C922<E922), \"Yes\", \"No\"),\"No\")","v":"No"},{"$f":"IF(I922 = \"Yes\", M921/(C922+CostBuy), IF(J922 = \"Yes\", 0, K921))","v":0},null,{"$f":"IF(I922 = \"Yes\", M921-(C922+CostBuy)*K922, IF(J922=\"Yes\", M921+(C922-CostSell)*K921, M921+K922*Rate))","v":1978348.2002404763}]
[null,1946.1,14.75,{"$f":"AVERAGE(C917:C922)","v":17.796666666666667},{"$f":"AVERAGE(C915:C922)","v":17.797499999999999},null,"No",null,{"$f":"IF(BuyAllowed=\"Yes\",IF(AND(G923 = \"No\", C923>D923), \"Yes\", \"No\"),\"No\")","v":"No"},{"$f":"IF(SellAllowed=\"Yes\",IF(AND(G923 = \"Yes\", C923<E923), \"Yes\", \"No\"),\"No\")","v":"No"},{"$f":"IF(I923 = \"Yes\", M922/(C923+CostBuy), IF(J923 = \"Yes\", 0, K922))","v":0},null,{"$f":"IF(I923 = \"Yes\", M922-(C923+CostBuy)*K923, IF(J923=\"Yes\", M922+(C923-CostSell)*K922, M922+K923*Rate))","v":1978348.2002404763}]
[null,1946.11,14.69,17.145,17.3825,null,{"$f":"IF(I923 = \"Yes\", \"Yes\", IF(J923=\"Yes\", \"No\", G923))","v":"No"},null,{"$f":"IF(BuyAllowed=\"Yes\",IF(AND(G924 = \"No\", C924>D924), \"Yes\", \"No\"),\"No\")","v":"No"},{"$f":"IF(SellAllowed=\"Yes\",IF(AND(G924 = \"Yes\", C924<E924), \"Yes\", \"No\"),\"No\")","v":"No"},{"$f":"IF(I924 = \"Yes\", M923/(C924+CostBuy), IF(J924 = \"Yes\", 0, K923))","v":0},null,{"$f":"IF(I924 = \"Yes\", M923-(C924+CostBuy)*K924, IF(J924=\"Yes\", M923+(C924-CostSell)*K923, M923+K924*Rate))","v":1978348.2002404763}]
[null,1946.12,15.13,16.476666666666667,17.0275,null,"No",null,{"$f":"IF(BuyAllowed=\"Yes\",IF(AND(G925 = \"No\", C925>D925), \"Yes\", \"No\"),\"No\")","v":"No"},{"$f":"IF(SellAllowed=\"Yes\",IF(AND(G925 = \"Yes\", C925<E925), \"Yes\", \"No\"),\"No\")","v":"No"},{"$f":"IF(I925 = \"Yes\", M924/(C925+CostBuy), IF(J925 = \"Yes\", 0, K924))","v":0},null,{"$f":"IF(I925 = \"Yes\", M924-(C925+CostBuy)*K925, IF(J925=\"Yes\", M924+(C925-CostSell)*K924, M924+K925*Rate))","v":1978348.2002404763}]
[null,1947.01,15.21,15.901666666666666,16.58625,null,"No",null,{"$f":"IF(BuyAllowed=\"Yes\",IF(AND(G926 = \"No\", C926>D926), \"Yes\", \"No\"),\"No\")","v":"No"},{"$f":"IF(SellAllowed=\"Yes\",IF(AND(G926 = \"Yes\", C926<E926), \"Yes\", \"No\"),\"No\")","v":"No"},{"$f":"IF(I926 = \"Yes\", M925/(C926+CostBuy), IF(J926 = \"Yes\", 0, K925))","v":0},null,{"$f":"IF(I926 = \"Yes\", M925-(C926+CostBuy)*K926, IF(J926=\"Yes\", M925+(C926-CostSell)*K925, M925+K926*Rate))","v":1978348.2002404763}]
[null,1947.02,15.8,15.428333333333333,16.149999999999999,null,"No",null,{"$f":"IF(BuyAllowed=\"Yes\",IF(AND(G927 = \"No\", C927>D927), \"Yes\", \"No\"),\"No\")","v":"Yes"},{"$f":"IF(SellAllowed=\"Yes\",IF(AND(G927 = \"Yes\", C927<E927), \"Yes\", \"No\"),\"No\")","v":"No"},{"$f":"IF(I927 = \"Yes\", M926/(C927+CostBuy), IF(J927 = \"Yes\", 0, K926))","v":124974.61782946787},null,{"$f":"IF(I927 = \"Yes\", M926-(C927+CostBuy)*K927, IF(J927=\"Yes\", M926+(C927-CostSell)*K926, M926+K927*Rate))","v":0}]
[null,1947.03,15.16,15.111666666666666,15.8025,null,"Yes",null,{"$f":"IF(BuyAllowed=\"Yes\",IF(AND(G928 = \"No\", C928>D928), \"Yes\", \"No\"),\"No\")","v":"No"},{"$f":"IF(SellAllowed=\"Yes\",IF(AND(G928 = \"Yes\", C928<E928), \"Yes\", \"No\"),\"No\")","v":"Yes"},{"$f":"IF(I928 = \"Yes\", M927/(C928+CostBuy), IF(J928 = \"Yes\", 0, K927))","v":0},null,{"$f":"IF(I928 = \"Yes\", M927-(C928+CostBuy)*K928, IF(J928=\"Yes\", M927+(C928-CostSell)*K927, M927+K928*Rate))","v":1887116.7292249647}]
[null,1947.04,14.6,15.123333333333333,15.441249999999998,null,"No",null,{"$f":"IF(BuyAllowed=\"Yes\",IF(AND(G929 = \"No\", C929>D929), \"Yes\", \"No\"),\"No\")","v":"No"},{"$f":"IF(SellAllowed=\"Yes\",IF(AND(G929 = \"Yes\", C929<E929), \"Yes\", \"No\"),\"No\")","v":"No"},{"$f":"IF(I929 = \"Yes\", M928/(C929+CostBuy), IF(J929 = \"Yes\", 0, K928))","v":0},null,{"$f":"IF(I929 = \"Yes\", M928-(C929+CostBuy)*K929, IF(J929=\"Yes\", M928+(C929-CostSell)*K928, M928+K929*Rate))","v":1887116.7292249647}]
[null,1947.05,14.34,15.098333333333331,15.053749999999999,null,"No",null,{"$f":"IF(BuyAllowed=\"Yes\",IF(AND(G930 = \"No\", C930>D930), \"Yes\", \"No\"),\"No\")","v":"No"},{"$f":"IF(SellAllowed=\"Yes\",IF(AND(G930 = \"Yes\", C930<E930), \"Yes\", \"No\"),\"No\")","v":"No"},{"$f":"IF(I930 = \"Yes\", M929/(C930+CostBuy), IF(J930 = \"Yes\", 0, K929))","v":0},null,{"$f":"IF(I930 = \"Yes\", M929-(C930+CostBuy)*K930, IF(J930=\"Yes\", M929+(C930-CostSell)*K929, M929+K930*Rate))","v":1887116.7292249647}]
[null,1947.06,14.84,15.04,14.959999999999999,null,"No",null,{"$f":"IF(BuyAllowed=\"Yes\",IF(AND(G931 = \"No\", C931>D931), \"Yes\", \"No\"),\"No\")","v":"No"},{"$f":"IF(SellAllowed=\"Yes\",IF(AND(G931 = \"Yes\", C931<E931), \"Yes\", \"No\"),\"No\")","v":"No"},{"$f":"IF(I931 = \"Yes\", M930/(C931+CostBuy), IF(J931 = \"Yes\", 0, K930))","v":0},null,{"$f":"IF(I931 = \"Yes\", M930-(C931+CostBuy)*K931, IF(J931=\"Yes\", M930+(C931-CostSell)*K930, M930+K931*Rate))","v":1887116.7292249647}]
[null,1947.07,15.77,14.991666666666667,14.97125,null,"No",null,{"$f":"IF(BuyAllowed=\"Yes\",IF(AND(G932 = \"No\", C932>D932), \"Yes\", \"No\"),\"No\")","v":"Yes"},{"$f":"IF(SellAllowed=\"Yes\",IF(AND(G932 = \"Yes\", C932<E932), \"Yes\", \"No\"),\"No\")","v":"No"},{"$f":"IF(I932 = \"Yes\", M931/(C932+CostBuy), IF(J932 = \"Yes\", 0, K931))","v":119437.76767246613},null,{"$f":"IF(I932 = \"Yes\", M931-(C932+CostBuy)*K932, IF(J932=\"Yes\", M931+(C932-CostSell)*K931, M931+K932*Rate))","v":0}]
[null,1947.08,15.46,15.085000000000001,15.106249999999999,null,"Yes",null,{"$f":"IF(BuyAllowed=\"Yes\",IF(AND(G933 = \"No\", C933>D933), \"Yes\", \"No\"),\"No\")","v":"No"},{"$f":"IF(SellAllowed=\"Yes\",IF(AND(G933 = \"Yes\", C933<E933), \"Yes\", \"No\"),\"No\")","v":"No"},{"$f":"IF(I933 = \"Yes\", M932/(C933+CostBuy), IF(J933 = \"Yes\", 0, K932))","v":119437.76767246613},null,{"$f":"IF(I933 = \"Yes\", M932-(C933+CostBuy)*K933, IF(J933=\"Yes\", M932+(C933-CostSell)*K932, M932+K933*Rate))","v":5971.8883836233072}]
[null,1947.09,15.06,15.028333333333331,15.147500000000001,null,"Yes",null,{"$f":"IF(BuyAllowed=\"Yes\",IF(AND(G934 = \"No\", C934>D934), \"Yes\", \"No\"),\"No\")","v":"No"},{"$f":"IF(SellAllowed=\"Yes\",IF(AND(G934 = \"Yes\", C934<E934), \"Yes\", \"No\"),\"No\")","v":"Yes"},{"$f":"IF(I934 = \"Yes\", M933/(C934+CostBuy), IF(J934 = \"Yes\", 0, K933))","v":0},null,{"$f":"IF(I934 = \"Yes\", M933-(C934+CostBuy)*K934, IF(J934=\"Yes\", M933+(C934-CostSell)*K933, M933+K934*Rate))","v":1797538.4034706152}]
[null,1947.1,15.45,15.011666666666665,15.12875,null,"No",null,{"$f":"IF(BuyAllowed=\"Yes\",IF(AND(G935 = \"No\", C935>D935), \"Yes\", \"No\"),\"No\")","v":"Yes"},{"$f":"IF(SellAllowed=\"Yes\",IF(AND(G935 = \"Yes\", C935<E935), \"Yes\", \"No\"),\"No\")","v":"No"},{"$f":"IF(I935 = \"Yes\", M934/(C935+CostBuy), IF(J935 = \"Yes\", 0, K934))","v":116120.05190378652},null,{"$f":"IF(I935 = \"Yes\", M934-(C935+CostBuy)*K935, IF(J935=\"Yes\", M934+(C935-CostSell)*K934, M934+K935*Rate))","v":0}]
[null,1947.11,15.27,15.153333333333334,15.084999999999999,null,"Yes",null,{"$f":"IF(BuyAllowed=\"Yes\",IF(AND(G936 = \"No\", C936>D936), \"Yes\", \"No\"),\"No\")","v":"No"},{"$f":"IF(SellAllowed=\"Yes\",IF(AND(G936 = \"Yes\", C936<E936), \"Yes\", \"No\"),\"No\")","v":"No"},{"$f":"IF(I936 = \"Yes\", M935/(C936+CostBuy), IF(J936 = \"Yes\", 0, K935))","v":116120.05190378652},null,{"$f":"IF(I936 = \"Yes\", M935-(C936+CostBuy)*K936, IF(J936=\"Yes\", M935+(C936-CostSell)*K935, M935+K936*Rate))","v":5806.0025951893258}]
[null,1947.12,15.03,15.308333333333332,15.098749999999999,null,"Yes",null,{"$f":"IF(BuyAllowed=\"Yes\",IF(AND(G937 = \"No\", C937>D937), \"Yes\", \"No\"),\"No\")","v":"No"},{"$f":"IF(SellAllowed=\"Yes\",IF(AND(G937 = \"Yes\", C937<E937), \"Yes\", \"No\"),\"No\")","v":"Yes"},{"$f":"IF(I937 = \"Yes\", M936/(C937+CostBuy), IF(J937 = \"Yes\", 0, K936))","v":0},null,{"$f":"IF(I937 = \"Yes\", M936-(C937+CostBuy)*K937, IF(J937=\"Yes\", M936+(C937-CostSell)*K936, M936+K937*Rate))","v":1744123.1795948732}]
[null,1948.01,14.83,15.339999999999998,15.1525,null,"No",null,{"$f":"IF(BuyAllowed=\"Yes\",IF(AND(G938 = \"No\", C938>D938), \"Yes\", \"No\"),\"No\")","v":"No"},{"$f":"IF(SellAllowed=\"Yes\",IF(AND(G938 = \"Yes\", C938<E938), \"Yes\", \"No\"),\"No\")","v":"No"},{"$f":"IF(I938 = \"Yes\", M937/(C938+CostBuy), IF(J938 = \"Yes\", 0, K937))","v":0},null,{"$f":"IF(I938 = \"Yes\", M937-(C938+CostBuy)*K938, IF(J938=\"Yes\", M937+(C938-CostSell)*K937, M937+K938*Rate))","v":1744123.1795948732}]
[null,1948.02,14.1,15.183333333333332,15.213749999999999,null,"No",null,{"$f":"IF(BuyAllowed=\"Yes\",IF(AND(G939 = \"No\", C939>D939), \"Yes\", \"No\"),\"No\")","v":"No"},{"$f":"IF(SellAllowed=\"Yes\",IF(AND(G939 = \"Yes\", C939<E939), \"Yes\", \"No\"),\"No\")","v":"No"},{"$f":"IF(I939 = \"Yes\", M938/(C939+CostBuy), IF(J939 = \"Yes\", 0, K938))","v":0},null,{"$f":"IF(I939 = \"Yes\", M938-(C939+CostBuy)*K939, IF(J939=\"Yes\", M938+(C939-CostSell)*K938, M938+K939*Rate))","v":1744123.1795948732}]
[null,1948.03,14.3,14.956666666666665,15.121249999999998,null,"No",null,{"$f":"IF(BuyAllowed=\"Yes\",IF(AND(G940 = \"No\", C940>D940), \"Yes\", \"No\"),\"No\")","v":"No"},{"$f":"IF(SellAllowed=\"Yes\",IF(AND(G940 = \"Yes\", C940<E940), \"Yes\", \"No\"),\"No\")","v":"No"},{"$f":"IF(I940 = \"Yes\", M939/(C940+CostBuy), IF(J940 = \"Yes\", 0, K939))","v":0},null,{"$f":"IF(I940 = \"Yes\", M939-(C940+CostBuy)*K940, IF(J940=\"Yes\", M939+(C940-CostSell)*K939, M939+K940*Rate))","v":1744123.1795948732}]
[null,1948.04,15.4,14.829999999999998,14.937499999999998,null,"No",null,{"$f":"IF(BuyAllowed=\"Yes\",IF(AND(G941 = \"No\", C941>D941), \"Yes\", \"No\"),\"No\")","v":"Yes"},{"$f":"IF(SellAllowed=\"Yes\",IF(AND(G941 = \"Yes\", C941<E941), \"Yes\", \"No\"),\"No\")","v":"No"},{"$f":"IF(I941 = \"Yes\", M940/(C941+CostBuy), IF(J941 = \"Yes\", 0, K940))","v":113034.55473719204},null,{"$f":"IF(I941 = \"Yes\", M940-(C941+CostBuy)*K941, IF(J941=\"Yes\", M940+(C941-CostSell)*K940, M940+K941*Rate))","v":0}]
[null,1948.05,16.149999999999999,14.821666666666667,14.93,null,"Yes",null,{"$f":"IF(BuyAllowed=\"Yes\",IF(AND(G942 = \"No\", C942>D942), \"Yes\", \"No\"),\"No\")","v":"No"},{"$f":"IF(SellAllowed=\"Yes\",IF(AND(G942 = \"Yes\", C942<E942), \"Yes\", \"No\"),\"No\")","v":"No"},{"$f":"IF(I942 = \"Yes\", M941/(C942+CostBuy), IF(J942 = \"Yes\", 0, K941))","v":113034.55473719204},null,{"$f":"IF(I942 = \"Yes\", M941-(C942+CostBuy)*K942, IF(J942=\"Yes\", M941+(C942-CostSell)*K941, M941+K942*Rate))","v":5651.7277368596024}]
[null,1948.06,16.82,14.968333333333334,15.06625,null,"Yes",null,{"$f":"IF(BuyAllowed=\"Yes\",IF(AND(G943 = \"No\", C943>D943), \"Yes\", \"No\"),\"No\")","v":"No"},{"$f":"IF(SellAllowed=\"Yes\",IF(AND(G943 = \"Yes\", C943<E943), \"Yes\", \"No\"),\"No\")","v":"No"},{"$f":"IF(I943 = \"Yes\", M942/(C943+CostBuy), IF(J943 = \"Yes\", 0, K942))","v":113034.55473719204},null,{"$f":"IF(I943 = \"Yes\", M942-(C943+CostBuy)*K943, IF(J943=\"Yes\", M942+(C943-CostSell)*K942, M942+K943*Rate))","v":11303.455473719205}]
[null,1948.07,16.420000000000002,15.266666666666666,15.237500000000001,null,"Yes",null,{"$f":"IF(BuyAllowed=\"Yes\",IF(AND(G944 = \"No\", C944>D944), \"Yes\", \"No\"),\"No\")","v":"No"},{"$f":"IF(SellAllowed=\"Yes\",IF(AND(G944 = \"Yes\", C944<E944), \"Yes\", \"No\"),\"No\")","v":"No"},{"$f":"IF(I944 = \"Yes\", M943/(C944+CostBuy), IF(J944 = \"Yes\", 0, K943))","v":113034.55473719204},null,{"$f":"IF(I944 = \"Yes\", M943-(C944+CostBuy)*K944, IF(J944=\"Yes\", M943+(C944-CostSell)*K943, M943+K944*Rate))","v":16955.183210578805}]
[null,1948.08,15.94,15.531666666666666,15.38125,null,"Yes",null,{"$f":"IF(BuyAllowed=\"Yes\",IF(AND(G945 = \"No\", C945>D945), \"Yes\", \"No\"),\"No\")","v":"No"},{"$f":"IF(SellAllowed=\"Yes\",IF(AND(G945 = \"Yes\", C945<E945), \"Yes\", \"No\"),\"No\")","v":"No"},{"$f":"IF(I945 = \"Yes\", M944/(C945+CostBuy), IF(J945 = \"Yes\", 0, K944))","v":113034.55473719204},null,{"$f":"IF(I945 = \"Yes\", M944-(C945+CostBuy)*K945, IF(J945=\"Yes\", M944+(C945-CostSell)*K944, M944+K945*Rate))","v":22606.910947438409}]
[null,1948.09,15.76,15.838333333333333,15.494999999999999,null,"Yes",null,{"$f":"IF(BuyAllowed=\"Yes\",IF(AND(G946 = \"No\", C946>D946), \"Yes\", \"No\"),\"No\")","v":"No"},{"$f":"IF(SellAllowed=\"Yes\",IF(AND(G946 = \"Yes\", C946<E946), \"Yes\", \"No\"),\"No\")","v":"No"},{"$f":"IF(I946 = \"Yes\", M945/(C946+CostBuy), IF(J946 = \"Yes\", 0, K945))","v":113034.55473719204},null,{"$f":"IF(I946 = \"Yes\", M945-(C946+CostBuy)*K946, IF(J946=\"Yes\", M945+(C946-CostSell)*K945, M945+K946*Rate))","v":28258.638684298014}]
[null,1948.1,16.190000000000001,16.081666666666667,15.61125,null,"Yes",null,{"$f":"IF(BuyAllowed=\"Yes\",IF(AND(G947 = \"No\", C947>D947), \"Yes\", \"No\"),\"No\")","v":"No"},{"$f":"IF(SellAllowed=\"Yes\",IF(AND(G947 = \"Yes\", C947<E947), \"Yes\", \"No\"),\"No\")","v":"No"},{"$f":"IF(I947 = \"Yes\", M946/(C947+CostBuy), IF(J947 = \"Yes\", 0, K946))","v":113034.55473719204},null,{"$f":"IF(I947 = \"Yes\", M946-(C947+CostBuy)*K947, IF(J947=\"Yes\", M946+(C947-CostSell)*K946, M946+K947*Rate))","v":33910.366421157618}]
[null,1948.11,15.29,16.213333333333335,15.8725,null,"Yes",null,{"$f":"IF(BuyAllowed=\"Yes\",IF(AND(G948 = \"No\", C948>D948), \"Yes\", \"No\"),\"No\")","v":"No"},{"$f":"IF(SellAllowed=\"Yes\",IF(AND(G948 = \"Yes\", C948<E948), \"Yes\", \"No\"),\"No\")","v":"Yes"},{"$f":"IF(I948 = \"Yes\", M947/(C948+CostBuy), IF(J948 = \"Yes\", 0, K947))","v":0},null,{"$f":"IF(I948 = \"Yes\", M947-(C948+CostBuy)*K948, IF(J948=\"Yes\", M947+(C948-CostSell)*K947, M947+K948*Rate))","v":1755426.6350685924}]
[null,1948.12,15.19,16.069999999999997,15.99625,null,"No",null,{"$f":"IF(BuyAllowed=\"Yes\",IF(AND(G949 = \"No\", C949>D949), \"Yes\", \"No\"),\"No\")","v":"No"},{"$f":"IF(SellAllowed=\"Yes\",IF(AND(G949 = \"Yes\", C949<E949), \"Yes\", \"No\"),\"No\")","v":"No"},{"$f":"IF(I949 = \"Yes\", M948/(C949+CostBuy), IF(J949 = \"Yes\", 0, K948))","v":0},null,{"$f":"IF(I949 = \"Yes\", M948-(C949+CostBuy)*K949, IF(J949=\"Yes\", M948+(C949-CostSell)*K948, M948+K949*Rate))","v":1755426.6350685924}]
[null,1949.01,15.36,15.798333333333332,15.969999999999999,null,"No",null,{"$f":"IF(BuyAllowed=\"Yes\",IF(AND(G950 = \"No\", C950>D950), \"Yes\", \"No\"),\"No\")","v":"No"},{"$f":"IF(SellAllowed=\"Yes\",IF(AND(G950 = \"Yes\", C950<E950), \"Yes\", \"No\"),\"No\")","v":"No"},{"$f":"IF(I950 = \"Yes\", M949/(C950+CostBuy), IF(J950 = \"Yes\", 0, K949))","v":0},null,{"$f":"IF(I950 = \"Yes\", M949-(C950+CostBuy)*K950, IF(J950=\"Yes\", M949+(C950-CostSell)*K949, M949+K950*Rate))","v":1755426.6350685924}]
[null,1949.02,14.77,15.621666666666668,15.871249999999998,null,"No",null,{"$f":"IF(BuyAllowed=\"Yes\",IF(AND(G951 = \"No\", C951>D951), \"Yes\", \"No\"),\"No\")","v":"No"},{"$f":"IF(SellAllowed=\"Yes\",IF(AND(G951 = \"Yes\", C951<E951), \"Yes\", \"No\"),\"No\")","v":"No"},{"$f":"IF(I951 = \"Yes\", M950/(C951+CostBuy), IF(J951 = \"Yes\", 0, K950))","v":0},null,{"$f":"IF(I951 = \"Yes\", M950-(C951+CostBuy)*K951, IF(J951=\"Yes\", M950+(C951-CostSell)*K950, M950+K951*Rate))","v":1755426.6350685924}]
[null,1949.03,14.91,15.426666666666664,15.614999999999998,null,"No",null,{"$f":"IF(BuyAllowed=\"Yes\",IF(AND(G952 = \"No\", C952>D952), \"Yes\", \"No\"),\"No\")","v":"No"},{"$f":"IF(SellAllowed=\"Yes\",IF(AND(G952 = \"Yes\", C952<E952), \"Yes\", \"No\"),\"No\")","v":"No"},{"$f":"IF(I952 = \"Yes\", M951/(C952+CostBuy), IF(J952 = \"Yes\", 0, K951))","v":0},null,{"$f":"IF(I952 = \"Yes\", M951-(C952+CostBuy)*K952, IF(J952=\"Yes\", M951+(C952-CostSell)*K951, M951+K952*Rate))","v":1755426.6350685924}]
[null,1949.04,14.89,15.284999999999998,15.42625,null,"No",null,{"$f":"IF(BuyAllowed=\"Yes\",IF(AND(G953 = \"No\", C953>D953), \"Yes\", \"No\"),\"No\")","v":"No"},{"$f":"IF(SellAllowed=\"Yes\",IF(AND(G953 = \"Yes\", C953<E953), \"Yes\", \"No\"),\"No\")","v":"No"},{"$f":"IF(I953 = \"Yes\", M952/(C953+CostBuy), IF(J953 = \"Yes\", 0, K952))","v":0},null,{"$f":"IF(I953 = \"Yes\", M952-(C953+CostBuy)*K953, IF(J953=\"Yes\", M952+(C953-CostSell)*K952, M952+K953*Rate))","v":1755426.6350685924}]
[null,1949.05,14.78,15.068333333333333,15.294999999999998,null,"No",null,{"$f":"IF(BuyAllowed=\"Yes\",IF(AND(G954 = \"No\", C954>D954), \"Yes\", \"No\"),\"No\")","v":"No"},{"$f":"IF(SellAllowed=\"Yes\",IF(AND(G954 = \"Yes\", C954<E954), \"Yes\", \"No\"),\"No\")","v":"No"},{"$f":"IF(I954 = \"Yes\", M953/(C954+CostBuy), IF(J954 = \"Yes\", 0, K953))","v":0},null,{"$f":"IF(I954 = \"Yes\", M953-(C954+CostBuy)*K954, IF(J954=\"Yes\", M953+(C954-CostSell)*K953, M953+K954*Rate))","v":1755426.6350685924}]
[null,1949.06,13.97,14.983333333333333,15.172499999999999,null,"No",null,{"$f":"IF(BuyAllowed=\"Yes\",IF(AND(G955 = \"No\", C955>D955), \"Yes\", \"No\"),\"No\")","v":"No"},{"$f":"IF(SellAllowed=\"Yes\",IF(AND(G955 = \"Yes\", C955<E955), \"Yes\", \"No\"),\"No\")","v":"No"},{"$f":"IF(I955 = \"Yes\", M954/(C955+CostBuy), IF(J955 = \"Yes\", 0, K954))","v":0},null,{"$f":"IF(I955 = \"Yes\", M954-(C955+CostBuy)*K955, IF(J955=\"Yes\", M954+(C955-CostSell)*K954, M954+K955*Rate))","v":1755426.6350685924}]
[null,1949.07,14.76,14.78,14.895,null,"No",null,{"$f":"IF(BuyAllowed=\"Yes\",IF(AND(G956 = \"No\", C956>D956), \"Yes\", \"No\"),\"No\")","v":"No"},{"$f":"IF(SellAllowed=\"Yes\",IF(AND(G956 = \"Yes\", C956<E956), \"Yes\", \"No\"),\"No\")","v":"No"},{"$f":"IF(I956 = \"Yes\", M955/(C956+CostBuy), IF(J956 = \"Yes\", 0, K955))","v":0},null,{"$f":"IF(I956 = \"Yes\", M955-(C956+CostBuy)*K956, IF(J956=\"Yes\", M955+(C956-CostSell)*K955, M955+K956*Rate))","v":1755426.6350685924}]
[null,1949.08,15.29,14.680000000000001,14.828749999999999,null,"No",null,{"$f":"IF(BuyAllowed=\"Yes\",IF(AND(G957 = \"No\", C957>D957), \"Yes\", \"No\"),\"No\")","v":"Yes"},{"$f":"IF(SellAllowed=\"Yes\",IF(AND(G957 = \"Yes\", C957<E957), \"Yes\", \"No\"),\"No\")","v":"No"},{"$f":"IF(I957 = \"Yes\", M956/(C957+CostBuy), IF(J957 = \"Yes\", 0, K956))","v":114583.98401231022},null,{"$f":"IF(I957 = \"Yes\", M956-(C957+CostBuy)*K957, IF(J957=\"Yes\", M956+(C957-CostSell)*K956, M956+K957*Rate))","v":0}]
[null,1949.09,15.49,14.766666666666666,14.841249999999999,null,"Yes",null,{"$f":"IF(BuyAllowed=\"Yes\",IF(AND(G958 = \"No\", C958>D958), \"Yes\", \"No\"),\"No\")","v":"No"},{"$f":"IF(SellAllowed=\"Yes\",IF(AND(G958 = \"Yes\", C958<E958), \"Yes\", \"No\"),\"No\")","v":"No"},{"$f":"IF(I958 = \"Yes\", M957/(C958+CostBuy), IF(J958 = \"Yes\", 0, K957))","v":114583.98401231022},null,{"$f":"IF(I958 = \"Yes\", M957-(C958+CostBuy)*K958, IF(J958=\"Yes\", M957+(C958-CostSell)*K957, M957+K958*Rate))","v":5729.1992006155115}]
[null,1949.1,15.89,14.863333333333332,14.8575,null,"Yes",null,{"$f":"IF(BuyAllowed=\"Yes\",IF(AND(G959 = \"No\", C959>D959), \"Yes\", \"No\"),\"No\")","v":"No"},{"$f":"IF(SellAllowed=\"Yes\",IF(AND(G959 = \"Yes\", C959<E959), \"Yes\", \"No\"),\"No\")","v":"No"},{"$f":"IF(I959 = \"Yes\", M958/(C959+CostBuy), IF(J959 = \"Yes\", 0, K958))","v":114583.98401231022},null,{"$f":"IF(I959 = \"Yes\", M958-(C959+CostBuy)*K959, IF(J959=\"Yes\", M958+(C959-CostSell)*K958, M958+K959*Rate))","v":11458.398401231023}]
[null,1949.11,16.11,15.03,14.997499999999999,null,"Yes",null,{"$f":"IF(BuyAllowed=\"Yes\",IF(AND(G960 = \"No\", C960>D960), \"Yes\", \"No\"),\"No\")","v":"No"},{"$f":"IF(SellAllowed=\"Yes\",IF(AND(G960 = \"Yes\", C960<E960), \"Yes\", \"No\"),\"No\")","v":"No"},{"$f":"IF(I960 = \"Yes\", M959/(C960+CostBuy), IF(J960 = \"Yes\", 0, K959))","v":114583.98401231022},null,{"$f":"IF(I960 = \"Yes\", M959-(C960+CostBuy)*K960, IF(J960=\"Yes\", M959+(C960-CostSell)*K959, M959+K960*Rate))","v":17187.597601846534}]
[null,1949.12,16.54,15.251666666666667,15.147499999999999,null,"Yes",null,{"$f":"IF(BuyAllowed=\"Yes\",IF(AND(G961 = \"No\", C961>D961), \"Yes\", \"No\"),\"No\")","v":"No"},{"$f":"IF(SellAllowed=\"Yes\",IF(AND(G961 = \"Yes\", C961<E961), \"Yes\", \"No\"),\"No\")","v":"No"},{"$f":"IF(I961 = \"Yes\", M960/(C961+CostBuy), IF(J961 = \"Yes\", 0, K960))","v":114583.98401231022},null,{"$f":"IF(I961 = \"Yes\", M960-(C961+CostBuy)*K961, IF(J961=\"Yes\", M960+(C961-CostSell)*K960, M960+K961*Rate))","v":22916.796802462046}]
[null,1950.01,16.88,15.679999999999998,15.353749999999998,null,"Yes",null,{"$f":"IF(BuyAllowed=\"Yes\",IF(AND(G962 = \"No\", C962>D962), \"Yes\", \"No\"),\"No\")","v":"No"},{"$f":"IF(SellAllowed=\"Yes\",IF(AND(G962 = \"Yes\", C962<E962), \"Yes\", \"No\"),\"No\")","v":"No"},{"$f":"IF(I962 = \"Yes\", M961/(C962+CostBuy), IF(J962 = \"Yes\", 0, K961))","v":114583.98401231022},null,{"$f":"IF(I962 = \"Yes\", M961-(C962+CostBuy)*K962, IF(J962=\"Yes\", M961+(C962-CostSell)*K961, M961+K962*Rate))","v":28645.996003077558}]
[null,1950.02,17.21,16.033333333333331,15.616250000000001,null,"Yes",null,{"$f":"IF(BuyAllowed=\"Yes\",IF(AND(G963 = \"No\", C963>D963), \"Yes\", \"No\"),\"No\")","v":"No"},{"$f":"IF(SellAllowed=\"Yes\",IF(AND(G963 = \"Yes\", C963<E963), \"Yes\", \"No\"),\"No\")","v":"No"},{"$f":"IF(I963 = \"Yes\", M962/(C963+CostBuy), IF(J963 = \"Yes\", 0, K962))","v":114583.98401231022},null,{"$f":"IF(I963 = \"Yes\", M962-(C963+CostBuy)*K963, IF(J963=\"Yes\", M962+(C963-CostSell)*K962, M962+K963*Rate))","v":34375.195203693067}]
[null,1950.03,17.350000000000001,16.353333333333335,16.021249999999998,null,"Yes",null,{"$f":"IF(BuyAllowed=\"Yes\",IF(AND(G964 = \"No\", C964>D964), \"Yes\", \"No\"),\"No\")","v":"No"},{"$f":"IF(SellAllowed=\"Yes\",IF(AND(G964 = \"Yes\", C964<E964), \"Yes\", \"No\"),\"No\")","v":"No"},{"$f":"IF(I964 = \"Yes\", M963/(C964+CostBuy), IF(J964 = \"Yes\", 0, K963))","v":114583.98401231022},null,{"$f":"IF(I964 = \"Yes\", M963-(C964+CostBuy)*K964, IF(J964=\"Yes\", M963+(C964-CostSell)*K963, M963+K964*Rate))","v":40104.394404308579}]
[null,1950.04,17.84,16.66333333333333,16.344999999999999,null,"Yes",null,{"$f":"IF(BuyAllowed=\"Yes\",IF(AND(G965 = \"No\", C965>D965), \"Yes\", \"No\"),\"No\")","v":"No"},{"$f":"IF(SellAllowed=\"Yes\",IF(AND(G965 = \"Yes\", C965<E965), \"Yes\", \"No\"),\"No\")","v":"No"},{"$f":"IF(I965 = \"Yes\", M964/(C965+CostBuy), IF(J965 = \"Yes\", 0, K964))","v":114583.98401231022},null,{"$f":"IF(I965 = \"Yes\", M964-(C965+CostBuy)*K965, IF(J965=\"Yes\", M964+(C965-CostSell)*K964, M964+K965*Rate))","v":45833.593604924092}]
[null,1950.05,18.440000000000001,16.988333333333333,16.66375,null,"Yes",null,{"$f":"IF(BuyAllowed=\"Yes\",IF(AND(G966 = \"No\", C966>D966), \"Yes\", \"No\"),\"No\")","v":"No"},{"$f":"IF(SellAllowed=\"Yes\",IF(AND(G966 = \"Yes\", C966<E966), \"Yes\", \"No\"),\"No\")","v":"No"},{"$f":"IF(I966 = \"Yes\", M965/(C966+CostBuy), IF(J966 = \"Yes\", 0, K965))","v":114583.98401231022},null,{"$f":"IF(I966 = \"Yes\", M965-(C966+CostBuy)*K966, IF(J966=\"Yes\", M965+(C966-CostSell)*K965, M965+K966*Rate))","v":51562.792805539604}]
[null,1950.06,18.739999999999998,17.376666666666669,17.032499999999999,null,"Yes",null,{"$f":"IF(BuyAllowed=\"Yes\",IF(AND(G967 = \"No\", C967>D967), \"Yes\", \"No\"),\"No\")","v":"No"},{"$f":"IF(SellAllowed=\"Yes\",IF(AND(G967 = \"Yes\", C967<E967), \"Yes\", \"No\"),\"No\")","v":"No"},{"$f":"IF(I967 = \"Yes\", M966/(C967+CostBuy), IF(J967 = \"Yes\", 0, K966))","v":114583.98401231022},null,{"$f":"IF(I967 = \"Yes\", M966-(C967+CostBuy)*K967, IF(J967=\"Yes\", M966+(C967-CostSell)*K966, M966+K967*Rate))","v":57291.992006155117}]
[null,1950.07,17.38,17.743333333333332,17.388750000000002,null,"Yes",null,{"$f":"IF(BuyAllowed=\"Yes\",IF(AND(G968 = \"No\", C968>D968), \"Yes\", \"No\"),\"No\")","v":"No"},{"$f":"IF(SellAllowed=\"Yes\",IF(AND(G968 = \"Yes\", C968<E968), \"Yes\", \"No\"),\"No\")","v":"Yes"},{"$f":"IF(I968 = \"Yes\", M967/(C968+CostBuy), IF(J968 = \"Yes\", 0, K967))","v":0},null,{"$f":"IF(I968 = \"Yes\", M967-(C968+CostBuy)*K968, IF(J968=\"Yes\", M967+(C968-CostSell)*K967, M967+K968*Rate))","v":2041886.5950993681}]
[null,1950.08,18.43,17.826666666666664,17.547499999999999,null,"No",null,{"$f":"IF(BuyAllowed=\"Yes\",IF(AND(G969 = \"No\", C969>D969), \"Yes\", \"No\"),\"No\")","v":"Yes"},{"$f":"IF(SellAllowed=\"Yes\",IF(AND(G969 = \"Yes\", C969<E969), \"Yes\", \"No\"),\"No\")","v":"No"},{"$f":"IF(I969 = \"Yes\", M968/(C969+CostBuy), IF(J969 = \"Yes\", 0, K968))","v":110611.40818523121},null,{"$f":"IF(I969 = \"Yes\", M968-(C969+CostBuy)*K969, IF(J969=\"Yes\", M968+(C969-CostSell)*K968, M968+K969*Rate))","v":0}]
[null,1950.09,19.079999999999998,18.029999999999998,17.783749999999998,null,"Yes",null,{"$f":"IF(BuyAllowed=\"Yes\",IF(AND(G970 = \"No\", C970>D970), \"Yes\", \"No\"),\"No\")","v":"No"},{"$f":"IF(SellAllowed=\"Yes\",IF(AND(G970 = \"Yes\", C970<E970), \"Yes\", \"No\"),\"No\")","v":"No"},{"$f":"IF(I970 = \"Yes\", M969/(C970+CostBuy), IF(J970 = \"Yes\", 0, K969))","v":110611.40818523121},null,{"$f":"IF(I970 = \"Yes\", M969-(C970+CostBuy)*K970, IF(J970=\"Yes\", M969+(C970-CostSell)*K969, M969+K970*Rate))","v":5530.5704092615606}]
[null,1950.1,19.87,18.318333333333332,18.058749999999996,null,"Yes",null,{"$f":"IF(BuyAllowed=\"Yes\",IF(AND(G971 = \"No\", C971>D971), \"Yes\", \"No\"),\"No\")","v":"No"},{"$f":"IF(SellAllowed=\"Yes\",IF(AND(G971 = \"Yes\", C971<E971), \"Yes\", \"No\"),\"No\")","v":"No"},{"$f":"IF(I971 = \"Yes\", M970/(C971+CostBuy), IF(J971 = \"Yes\", 0, K970))","v":110611.40818523121},null,{"$f":"IF(I971 = \"Yes\", M970-(C971+CostBuy)*K971, IF(J971=\"Yes\", M970+(C971-CostSell)*K970, M970+K971*Rate))","v":11061.140818523121}]
[null,1950.11,19.829999999999998,18.65666666666667,18.391249999999996,null,"Yes",null,{"$f":"IF(BuyAllowed=\"Yes\",IF(AND(G972 = \"No\", C972>D972), \"Yes\", \"No\"),\"No\")","v":"No"},{"$f":"IF(SellAllowed=\"Yes\",IF(AND(G972 = \"Yes\", C972<E972), \"Yes\", \"No\"),\"No\")","v":"No"},{"$f":"IF(I972 = \"Yes\", M971/(C972+CostBuy), IF(J972 = \"Yes\", 0, K971))","v":110611.40818523121},null,{"$f":"IF(I972 = \"Yes\", M971-(C972+CostBuy)*K972, IF(J972=\"Yes\", M971+(C972-CostSell)*K971, M971+K972*Rate))","v":16591.711227784683}]
[null,1950.12,19.75,18.888333333333332,18.701249999999995,null,"Yes",null,{"$f":"IF(BuyAllowed=\"Yes\",IF(AND(G973 = \"No\", C973>D973), \"Yes\", \"No\"),\"No\")","v":"No"},{"$f":"IF(SellAllowed=\"Yes\",IF(AND(G973 = \"Yes\", C973<E973), \"Yes\", \"No\"),\"No\")","v":"No"},{"$f":"IF(I973 = \"Yes\", M972/(C973+CostBuy), IF(J973 = \"Yes\", 0, K972))","v":110611.40818523121},null,{"$f":"IF(I973 = \"Yes\", M972-(C973+CostBuy)*K973, IF(J973=\"Yes\", M972+(C973-CostSell)*K972, M972+K973*Rate))","v":22122.281637046242}]
[null,1951.01,21.21,19.056666666666668,18.940000000000001,null,"Yes",null,{"$f":"IF(BuyAllowed=\"Yes\",IF(AND(G974 = \"No\", C974>D974), \"Yes\", \"No\"),\"No\")","v":"No"},{"$f":"IF(SellAllowed=\"Yes\",IF(AND(G974 = \"Yes\", C974<E974), \"Yes\", \"No\"),\"No\")","v":"No"},{"$f":"IF(I974 = \"Yes\", M973/(C974+CostBuy), IF(J974 = \"Yes\", 0, K973))","v":110611.40818523121},null,{"$f":"IF(I974 = \"Yes\", M973-(C974+CostBuy)*K974, IF(J974=\"Yes\", M973+(C974-CostSell)*K973, M973+K974*Rate))","v":27652.852046307802}]
[null,1951.02,22,19.694999999999997,19.286249999999999,null,"Yes",null,{"$f":"IF(BuyAllowed=\"Yes\",IF(AND(G975 = \"No\", C975>D975), \"Yes\", \"No\"),\"No\")","v":"No"},{"$f":"IF(SellAllowed=\"Yes\",IF(AND(G975 = \"Yes\", C975<E975), \"Yes\", \"No\"),\"No\")","v":"No"},{"$f":"IF(I975 = \"Yes\", M974/(C975+CostBuy), IF(J975 = \"Yes\", 0, K974))","v":110611.40818523121},null,{"$f":"IF(I975 = \"Yes\", M974-(C975+CostBuy)*K975, IF(J975=\"Yes\", M974+(C975-CostSell)*K974, M974+K975*Rate))","v":33183.422455569365}]
[null,1951.03,21.63,20.290000000000003,19.693750000000001,null,"Yes",null,{"$f":"IF(BuyAllowed=\"Yes\",IF(AND(G976 = \"No\", C976>D976), \"Yes\", \"No\"),\"No\")","v":"No"},{"$f":"IF(SellAllowed=\"Yes\",IF(AND(G976 = \"Yes\", C976<E976), \"Yes\", \"No\"),\"No\")","v":"No"},{"$f":"IF(I976 = \"Yes\", M975/(C976+CostBuy), IF(J976 = \"Yes\", 0, K975))","v":110611.40818523121},null,{"$f":"IF(I976 = \"Yes\", M975-(C976+CostBuy)*K976, IF(J976=\"Yes\", M975+(C976-CostSell)*K975, M975+K976*Rate))","v":38713.992864830929}]
[null,1951.04,21.92,20.715,20.224999999999998,null,"Yes",null,{"$f":"IF(BuyAllowed=\"Yes\",IF(AND(G977 = \"No\", C977>D977), \"Yes\", \"No\"),\"No\")","v":"No"},{"$f":"IF(SellAllowed=\"Yes\",IF(AND(G977 = \"Yes\", C977<E977), \"Yes\", \"No\"),\"No\")","v":"No"},{"$f":"IF(I977 = \"Yes\", M976/(C977+CostBuy), IF(J977 = \"Yes\", 0, K976))","v":110611.40818523121},null,{"$f":"IF(I977 = \"Yes\", M976-(C977+CostBuy)*K977, IF(J977=\"Yes\", M976+(C977-CostSell)*K976, M976+K977*Rate))","v":44244.563274092492}]
[null,1951.05,21.93,21.056666666666665,20.661250000000003,null,"Yes",null,{"$f":"IF(BuyAllowed=\"Yes\",IF(AND(G978 = \"No\", C978>D978), \"Yes\", \"No\"),\"No\")","v":"No"},{"$f":"IF(SellAllowed=\"Yes\",IF(AND(G978 = \"Yes\", C978<E978), \"Yes\", \"No\"),\"No\")","v":"No"},{"$f":"IF(I978 = \"Yes\", M977/(C978+CostBuy), IF(J978 = \"Yes\", 0, K977))","v":110611.40818523121},null,{"$f":"IF(I978 = \"Yes\", M977-(C978+CostBuy)*K978, IF(J978=\"Yes\", M977+(C978-CostSell)*K977, M977+K978*Rate))","v":49775.133683354055}]
[null,1951.06,21.55,21.406666666666666,21.017499999999998,null,"Yes",null,{"$f":"IF(BuyAllowed=\"Yes\",IF(AND(G979 = \"No\", C979>D979), \"Yes\", \"No\"),\"No\")","v":"No"},{"$f":"IF(SellAllowed=\"Yes\",IF(AND(G979 = \"Yes\", C979<E979), \"Yes\", \"No\"),\"No\")","v":"No"},{"$f":"IF(I979 = \"Yes\", M978/(C979+CostBuy), IF(J979 = \"Yes\", 0, K978))","v":110611.40818523121},null,{"$f":"IF(I979 = \"Yes\", M978-(C979+CostBuy)*K979, IF(J979=\"Yes\", M978+(C979-CostSell)*K978, M978+K979*Rate))","v":55305.704092615619}]
[null,1951.07,21.93,21.706666666666667,21.227499999999999,null,"Yes",null,{"$f":"IF(BuyAllowed=\"Yes\",IF(AND(G980 = \"No\", C980>D980), \"Yes\", \"No\"),\"No\")","v":"No"},{"$f":"IF(SellAllowed=\"Yes\",IF(AND(G980 = \"Yes\", C980<E980), \"Yes\", \"No\"),\"No\")","v":"No"},{"$f":"IF(I980 = \"Yes\", M979/(C980+CostBuy), IF(J980 = \"Yes\", 0, K979))","v":110611.40818523121},null,{"$f":"IF(I980 = \"Yes\", M979-(C980+CostBuy)*K980, IF(J980=\"Yes\", M979+(C980-CostSell)*K979, M979+K980*Rate))","v":60836.274501877182}]
[null,1951.08,22.89,21.826666666666664,21.490000000000002,null,"Yes",null,{"$f":"IF(BuyAllowed=\"Yes\",IF(AND(G981 = \"No\", C981>D981), \"Yes\", \"No\"),\"No\")","v":"No"},{"$f":"IF(SellAllowed=\"Yes\",IF(AND(G981 = \"Yes\", C981<E981), \"Yes\", \"No\"),\"No\")","v":"No"},{"$f":"IF(I981 = \"Yes\", M980/(C981+CostBuy), IF(J981 = \"Yes\", 0, K980))","v":110611.40818523121},null,{"$f":"IF(I981 = \"Yes\", M980-(C981+CostBuy)*K981, IF(J981=\"Yes\", M980+(C981-CostSell)*K980, M980+K981*Rate))","v":66366.844911138745}]
[null,1951.09,23.48,21.974999999999994,21.8825,null,"Yes",null,{"$f":"IF(BuyAllowed=\"Yes\",IF(AND(G982 = \"No\", C982>D982), \"Yes\", \"No\"),\"No\")","v":"No"},{"$f":"IF(SellAllowed=\"Yes\",IF(AND(G982 = \"Yes\", C982<E982), \"Yes\", \"No\"),\"No\")","v":"No"},{"$f":"IF(I982 = \"Yes\", M981/(C982+CostBuy), IF(J982 = \"Yes\", 0, K981))","v":110611.40818523121},null,{"$f":"IF(I982 = \"Yes\", M981-(C982+CostBuy)*K982, IF(J982=\"Yes\", M981+(C982-CostSell)*K981, M981+K982*Rate))","v":71897.415320400309}]
[null,1951.1,23.36,22.283333333333335,22.166249999999994,null,"Yes",null,{"$f":"IF(BuyAllowed=\"Yes\",IF(AND(G983 = \"No\", C983>D983), \"Yes\", \"No\"),\"No\")","v":"No"},{"$f":"IF(SellAllowed=\"Yes\",IF(AND(G983 = \"Yes\", C983<E983), \"Yes\", \"No\"),\"No\")","v":"No"},{"$f":"IF(I983 = \"Yes\", M982/(C983+CostBuy), IF(J983 = \"Yes\", 0, K982))","v":110611.40818523121},null,{"$f":"IF(I983 = \"Yes\", M982-(C983+CostBuy)*K983, IF(J983=\"Yes\", M982+(C983-CostSell)*K982, M982+K983*Rate))","v":77427.985729661872}]
[null,1951.11,22.71,22.52333333333333,22.336249999999993,null,"Yes",null,{"$f":"IF(BuyAllowed=\"Yes\",IF(AND(G984 = \"No\", C984>D984), \"Yes\", \"No\"),\"No\")","v":"No"},{"$f":"IF(SellAllowed=\"Yes\",IF(AND(G984 = \"Yes\", C984<E984), \"Yes\", \"No\"),\"No\")","v":"No"},{"$f":"IF(I984 = \"Yes\", M983/(C984+CostBuy), IF(J984 = \"Yes\", 0, K983))","v":110611.40818523121},null,{"$f":"IF(I984 = \"Yes\", M983-(C984+CostBuy)*K984, IF(J984=\"Yes\", M983+(C984-CostSell)*K983, M983+K984*Rate))","v":82958.556138923435}]
[null,1951.12,23.41,22.653333333333336,22.471250000000001,null,"Yes",null,{"$f":"IF(BuyAllowed=\"Yes\",IF(AND(G985 = \"No\", C985>D985), \"Yes\", \"No\"),\"No\")","v":"No"},{"$f":"IF(SellAllowed=\"Yes\",IF(AND(G985 = \"Yes\", C985<E985), \"Yes\", \"No\"),\"No\")","v":"No"},{"$f":"IF(I985 = \"Yes\", M984/(C985+CostBuy), IF(J985 = \"Yes\", 0, K984))","v":110611.40818523121},null,{"$f":"IF(I985 = \"Yes\", M984-(C985+CostBuy)*K985, IF(J985=\"Yes\", M984+(C985-CostSell)*K984, M984+K985*Rate))","v":88489.126548184999}]
[null,1952.01,24.19,22.963333333333335,22.657499999999999,null,"Yes",null,{"$f":"IF(BuyAllowed=\"Yes\",IF(AND(G986 = \"No\", C986>D986), \"Yes\", \"No\"),\"No\")","v":"No"},{"$f":"IF(SellAllowed=\"Yes\",IF(AND(G986 = \"Yes\", C986<E986), \"Yes\", \"No\"),\"No\")","v":"No"},{"$f":"IF(I986 = \"Yes\", M985/(C986+CostBuy), IF(J986 = \"Yes\", 0, K985))","v":110611.40818523121},null,{"$f":"IF(I986 = \"Yes\", M985-(C986+CostBuy)*K986, IF(J986=\"Yes\", M985+(C986-CostSell)*K985, M985+K986*Rate))","v":94019.696957446562}]
[null,1952.02,23.75,{"$f":"AVERAGE(C981:C986)","v":23.34},{"$f":"AVERAGE(C979:C986)","v":22.94},null,"Yes",null,{"$f":"IF(BuyAllowed=\"Yes\",IF(AND(G987 = \"No\", C987>D987), \"Yes\", \"No\"),\"No\")","v":"No"},{"$f":"IF(SellAllowed=\"Yes\",IF(AND(G987 = \"Yes\", C987<E987), \"Yes\", \"No\"),\"No\")","v":"No"},{"$f":"IF(I987 = \"Yes\", M986/(C987+CostBuy), IF(J987 = \"Yes\", 0, K986))","v":110611.40818523121},null,{"$f":"IF(I987 = \"Yes\", M986-(C987+CostBuy)*K987, IF(J987=\"Yes\", M986+(C987-CostSell)*K986, M986+K987*Rate))","v":99550.267366708125}]
[null,1952.03,23.81,23.483333333333334,23.215,null,{"$f":"IF(I987 = \"Yes\", \"Yes\", IF(J987=\"Yes\", \"No\", G987))","v":"Yes"},null,{"$f":"IF(BuyAllowed=\"Yes\",IF(AND(G988 = \"No\", C988>D988), \"Yes\", \"No\"),\"No\")","v":"No"},{"$f":"IF(SellAllowed=\"Yes\",IF(AND(G988 = \"Yes\", C988<E988), \"Yes\", \"No\"),\"No\")","v":"No"},{"$f":"IF(I988 = \"Yes\", M987/(C988+CostBuy), IF(J988 = \"Yes\", 0, K987))","v":110611.40818523121},null,{"$f":"IF(I988 = \"Yes\", M987-(C988+CostBuy)*K988, IF(J988=\"Yes\", M987+(C988-CostSell)*K987, M987+K988*Rate))","v":105080.83777596969}]
[null,1952.04,23.74,23.53833333333333,23.45,null,"Yes",null,{"$f":"IF(BuyAllowed=\"Yes\",IF(AND(G989 = \"No\", C989>D989), \"Yes\", \"No\"),\"No\")","v":"No"},{"$f":"IF(SellAllowed=\"Yes\",IF(AND(G989 = \"Yes\", C989<E989), \"Yes\", \"No\"),\"No\")","v":"No"},{"$f":"IF(I989 = \"Yes\", M988/(C989+CostBuy), IF(J989 = \"Yes\", 0, K988))","v":110611.40818523121},null,{"$f":"IF(I989 = \"Yes\", M988-(C989+CostBuy)*K989, IF(J989=\"Yes\", M988+(C989-CostSell)*K988, M988+K989*Rate))","v":110611.40818523125}]
[null,1952.05,23.73,23.60166666666667,23.556250000000002,null,"Yes",null,{"$f":"IF(BuyAllowed=\"Yes\",IF(AND(G990 = \"No\", C990>D990), \"Yes\", \"No\"),\"No\")","v":"No"},{"$f":"IF(SellAllowed=\"Yes\",IF(AND(G990 = \"Yes\", C990<E990), \"Yes\", \"No\"),\"No\")","v":"No"},{"$f":"IF(I990 = \"Yes\", M989/(C990+CostBuy), IF(J990 = \"Yes\", 0, K989))","v":110611.40818523121},null,{"$f":"IF(I990 = \"Yes\", M989-(C990+CostBuy)*K990, IF(J990=\"Yes\", M989+(C990-CostSell)*K989, M989+K990*Rate))","v":116141.97859449282}]
[null,1952.06,24.38,23.771666666666665,23.587499999999999,null,"Yes",null,{"$f":"IF(BuyAllowed=\"Yes\",IF(AND(G991 = \"No\", C991>D991), \"Yes\", \"No\"),\"No\")","v":"No"},{"$f":"IF(SellAllowed=\"Yes\",IF(AND(G991 = \"Yes\", C991<E991), \"Yes\", \"No\"),\"No\")","v":"No"},{"$f":"IF(I991 = \"Yes\", M990/(C991+CostBuy), IF(J991 = \"Yes\", 0, K990))","v":110611.40818523121},null,{"$f":"IF(I991 = \"Yes\", M990-(C991+CostBuy)*K991, IF(J991=\"Yes\", M990+(C991-CostSell)*K990, M990+K991*Rate))","v":121672.54900375438}]
[null,1952.07,25.08,23.933333333333334,23.715,null,"Yes",null,{"$f":"IF(BuyAllowed=\"Yes\",IF(AND(G992 = \"No\", C992>D992), \"Yes\", \"No\"),\"No\")","v":"No"},{"$f":"IF(SellAllowed=\"Yes\",IF(AND(G992 = \"Yes\", C992<E992), \"Yes\", \"No\"),\"No\")","v":"No"},{"$f":"IF(I992 = \"Yes\", M991/(C992+CostBuy), IF(J992 = \"Yes\", 0, K991))","v":110611.40818523121},null,{"$f":"IF(I992 = \"Yes\", M991-(C992+CostBuy)*K992, IF(J992=\"Yes\", M991+(C992-CostSell)*K991, M991+K992*Rate))","v":127203.11941301594}]
[null,1952.08,25.18,24.081666666666667,24.011249999999997,null,"Yes",null,{"$f":"IF(BuyAllowed=\"Yes\",IF(AND(G993 = \"No\", C993>D993), \"Yes\", \"No\"),\"No\")","v":"No"},{"$f":"IF(SellAllowed=\"Yes\",IF(AND(G993 = \"Yes\", C993<E993), \"Yes\", \"No\"),\"No\")","v":"No"},{"$f":"IF(I993 = \"Yes\", M992/(C993+CostBuy), IF(J993 = \"Yes\", 0, K992))","v":110611.40818523121},null,{"$f":"IF(I993 = \"Yes\", M992-(C993+CostBuy)*K993, IF(J993=\"Yes\", M992+(C993-CostSell)*K992, M992+K993*Rate))","v":132733.68982227749}]
[null,1952.09,24.78,24.319999999999997,24.232500000000002,null,"Yes",null,{"$f":"IF(BuyAllowed=\"Yes\",IF(AND(G994 = \"No\", C994>D994), \"Yes\", \"No\"),\"No\")","v":"No"},{"$f":"IF(SellAllowed=\"Yes\",IF(AND(G994 = \"Yes\", C994<E994), \"Yes\", \"No\"),\"No\")","v":"No"},{"$f":"IF(I994 = \"Yes\", M993/(C994+CostBuy), IF(J994 = \"Yes\", 0, K993))","v":110611.40818523121},null,{"$f":"IF(I994 = \"Yes\", M993-(C994+CostBuy)*K994, IF(J994=\"Yes\", M993+(C994-CostSell)*K993, M993+K994*Rate))","v":138264.26023153905}]
[null,1952.1,24.26,24.481666666666666,24.306250000000002,null,"Yes",null,{"$f":"IF(BuyAllowed=\"Yes\",IF(AND(G995 = \"No\", C995>D995), \"Yes\", \"No\"),\"No\")","v":"No"},{"$f":"IF(SellAllowed=\"Yes\",IF(AND(G995 = \"Yes\", C995<E995), \"Yes\", \"No\"),\"No\")","v":"Yes"},{"$f":"IF(I995 = \"Yes\", M994/(C995+CostBuy), IF(J995 = \"Yes\", 0, K994))","v":0},null,{"$f":"IF(I995 = \"Yes\", M994-(C995+CostBuy)*K995, IF(J995=\"Yes\", M994+(C995-CostSell)*K994, M994+K995*Rate))","v":2815060.3383141346}]
[null,1952.11,25.03,24.568333333333332,24.369999999999997,null,"No",null,{"$f":"IF(BuyAllowed=\"Yes\",IF(AND(G996 = \"No\", C996>D996), \"Yes\", \"No\"),\"No\")","v":"Yes"},{"$f":"IF(SellAllowed=\"Yes\",IF(AND(G996 = \"Yes\", C996<E996), \"Yes\", \"No\"),\"No\")","v":"No"},{"$f":"IF(I996 = \"Yes\", M995/(C996+CostBuy), IF(J996 = \"Yes\", 0, K995))","v":112332.81477710033},null,{"$f":"IF(I996 = \"Yes\", M995-(C996+CostBuy)*K996, IF(J996=\"Yes\", M995+(C996-CostSell)*K995, M995+K996*Rate))","v":0}]
[null,1952.12,26.04,24.784999999999997,24.522499999999997,null,"Yes",null,{"$f":"IF(BuyAllowed=\"Yes\",IF(AND(G997 = \"No\", C997>D997), \"Yes\", \"No\"),\"No\")","v":"No"},{"$f":"IF(SellAllowed=\"Yes\",IF(AND(G997 = \"Yes\", C997<E997), \"Yes\", \"No\"),\"No\")","v":"No"},{"$f":"IF(I997 = \"Yes\", M996/(C997+CostBuy), IF(J997 = \"Yes\", 0, K996))","v":112332.81477710033},null,{"$f":"IF(I997 = \"Yes\", M996-(C997+CostBuy)*K997, IF(J997=\"Yes\", M996+(C997-CostSell)*K996, M996+K997*Rate))","v":5616.6407388550169}]
[null,1953.01,26.18,25.061666666666667,24.81,null,"Yes",null,{"$f":"IF(BuyAllowed=\"Yes\",IF(AND(G998 = \"No\", C998>D998), \"Yes\", \"No\"),\"No\")","v":"No"},{"$f":"IF(SellAllowed=\"Yes\",IF(AND(G998 = \"Yes\", C998<E998), \"Yes\", \"No\"),\"No\")","v":"No"},{"$f":"IF(I998 = \"Yes\", M997/(C998+CostBuy), IF(J998 = \"Yes\", 0, K997))","v":112332.81477710033},null,{"$f":"IF(I998 = \"Yes\", M997-(C998+CostBuy)*K998, IF(J998=\"Yes\", M997+(C998-CostSell)*K997, M997+K998*Rate))","v":11233.281477710034}]
[null,1953.02,25.86,25.245000000000001,25.116249999999997,null,"Yes",null,{"$f":"IF(BuyAllowed=\"Yes\",IF(AND(G999 = \"No\", C999>D999), \"Yes\", \"No\"),\"No\")","v":"No"},{"$f":"IF(SellAllowed=\"Yes\",IF(AND(G999 = \"Yes\", C999<E999), \"Yes\", \"No\"),\"No\")","v":"No"},{"$f":"IF(I999 = \"Yes\", M998/(C999+CostBuy), IF(J999 = \"Yes\", 0, K998))","v":112332.81477710033},null,{"$f":"IF(I999 = \"Yes\", M998-(C999+CostBuy)*K999, IF(J999=\"Yes\", M998+(C999-CostSell)*K998, M998+K999*Rate))","v":16849.92221656505}]
[null,1953.03,25.99,25.358333333333338,25.301250000000003,null,"Yes",null,{"$f":"IF(BuyAllowed=\"Yes\",IF(AND(G1000 = \"No\", C1000>D1000), \"Yes\", \"No\"),\"No\")","v":"No"},{"$f":"IF(SellAllowed=\"Yes\",IF(AND(G1000 = \"Yes\", C1000<E1000), \"Yes\", \"No\"),\"No\")","v":"No"},{"$f":"IF(I1000 = \"Yes\", M999/(C1000+CostBuy), IF(J1000 = \"Yes\", 0, K999))","v":112332.81477710033},null,{"$f":"IF(I1000 = \"Yes\", M999-(C1000+CostBuy)*K1000, IF(J1000=\"Yes\", M999+(C1000-CostSell)*K999, M999+K1000*Rate))","v":22466.562955420068}]
[null,1953.04,24.71,25.560000000000002,25.414999999999999,null,"Yes",null,{"$f":"IF(BuyAllowed=\"Yes\",IF(AND(G1001 = \"No\", C1001>D1001), \"Yes\", \"No\"),\"No\")","v":"No"},{"$f":"IF(SellAllowed=\"Yes\",IF(AND(G1001 = \"Yes\", C1001<E1001), \"Yes\", \"No\"),\"No\")","v":"Yes"},{"$f":"IF(I1001 = \"Yes\", M1000/(C1001+CostBuy), IF(J1001 = \"Yes\", 0, K1000))","v":0},null,{"$f":"IF(I1001 = \"Yes\", M1000-(C1001+CostBuy)*K1001, IF(J1001=\"Yes\", M1000+(C1001-CostSell)*K1000, M1000+K1001*Rate))","v":2791470.4472109433}]
[null,1953.05,24.84,25.635000000000002,25.356250000000006,null,"No",null,{"$f":"IF(BuyAllowed=\"Yes\",IF(AND(G1002 = \"No\", C1002>D1002), \"Yes\", \"No\"),\"No\")","v":"No"},{"$f":"IF(SellAllowed=\"Yes\",IF(AND(G1002 = \"Yes\", C1002<E1002), \"Yes\", \"No\"),\"No\")","v":"No"},{"$f":"IF(I1002 = \"Yes\", M1001/(C1002+CostBuy), IF(J1002 = \"Yes\", 0, K1001))","v":0},null,{"$f":"IF(I1002 = \"Yes\", M1001-(C1002+CostBuy)*K1002, IF(J1002=\"Yes\", M1001+(C1002-CostSell)*K1001, M1001+K1002*Rate))","v":2791470.4472109433}]
[null,1953.06,23.95,25.603333333333335,25.363750000000003,null,"No",null,{"$f":"IF(BuyAllowed=\"Yes\",IF(AND(G1003 = \"No\", C1003>D1003), \"Yes\", \"No\"),\"No\")","v":"No"},{"$f":"IF(SellAllowed=\"Yes\",IF(AND(G1003 = \"Yes\", C1003<E1003), \"Yes\", \"No\"),\"No\")","v":"No"},{"$f":"IF(I1003 = \"Yes\", M1002/(C1003+CostBuy), IF(J1003 = \"Yes\", 0, K1002))","v":0},null,{"$f":"IF(I1003 = \"Yes\", M1002-(C1003+CostBuy)*K1003, IF(J1003=\"Yes\", M1002+(C1003-CostSell)*K1002, M1002+K1003*Rate))","v":2791470.4472109433}]
[null,1953.07,24.29,25.254999999999999,25.324999999999999,null,"No",null,{"$f":"IF(BuyAllowed=\"Yes\",IF(AND(G1004 = \"No\", C1004>D1004), \"Yes\", \"No\"),\"No\")","v":"No"},{"$f":"IF(SellAllowed=\"Yes\",IF(AND(G1004 = \"Yes\", C1004<E1004), \"Yes\", \"No\"),\"No\")","v":"No"},{"$f":"IF(I1004 = \"Yes\", M1003/(C1004+CostBuy), IF(J1004 = \"Yes\", 0, K1003))","v":0},null,{"$f":"IF(I1004 = \"Yes\", M1003-(C1004+CostBuy)*K1004, IF(J1004=\"Yes\", M1003+(C1004-CostSell)*K1003, M1003+K1004*Rate))","v":2791470.4472109433}]
[null,1953.08,24.39,24.94,25.232499999999998,null,"No",null,{"$f":"IF(BuyAllowed=\"Yes\",IF(AND(G1005 = \"No\", C1005>D1005), \"Yes\", \"No\"),\"No\")","v":"No"},{"$f":"IF(SellAllowed=\"Yes\",IF(AND(G1005 = \"Yes\", C1005<E1005), \"Yes\", \"No\"),\"No\")","v":"No"},{"$f":"IF(I1005 = \"Yes\", M1004/(C1005+CostBuy), IF(J1005 = \"Yes\", 0, K1004))","v":0},null,{"$f":"IF(I1005 = \"Yes\", M1004-(C1005+CostBuy)*K1005, IF(J1005=\"Yes\", M1004+(C1005-CostSell)*K1004, M1004+K1005*Rate))","v":2791470.4472109433}]
[null,1953.09,23.27,24.695000000000004,25.026249999999997,null,"No",null,{"$f":"IF(BuyAllowed=\"Yes\",IF(AND(G1006 = \"No\", C1006>D1006), \"Yes\", \"No\"),\"No\")","v":"No"},{"$f":"IF(SellAllowed=\"Yes\",IF(AND(G1006 = \"Yes\", C1006<E1006), \"Yes\", \"No\"),\"No\")","v":"No"},{"$f":"IF(I1006 = \"Yes\", M1005/(C1006+CostBuy), IF(J1006 = \"Yes\", 0, K1005))","v":0},null,{"$f":"IF(I1006 = \"Yes\", M1005-(C1006+CostBuy)*K1006, IF(J1006=\"Yes\", M1005+(C1006-CostSell)*K1005, M1005+K1006*Rate))","v":2791470.4472109433}]
[null,1953.1,23.97,24.241666666666664,24.662500000000005,null,"No",null,{"$f":"IF(BuyAllowed=\"Yes\",IF(AND(G1007 = \"No\", C1007>D1007), \"Yes\", \"No\"),\"No\")","v":"No"},{"$f":"IF(SellAllowed=\"Yes\",IF(AND(G1007 = \"Yes\", C1007<E1007), \"Yes\", \"No\"),\"No\")","v":"No"},{"$f":"IF(I1007 = \"Yes\", M1006/(C1007+CostBuy), IF(J1007 = \"Yes\", 0, K1006))","v":0},null,{"$f":"IF(I1007 = \"Yes\", M1006-(C1007+CostBuy)*K1007, IF(J1007=\"Yes\", M1006+(C1007-CostSell)*K1006, M1006+K1007*Rate))","v":2791470.4472109433}]
[null,1953.11,24.5,24.118333333333329,24.426250000000003,null,"No",null,{"$f":"IF(BuyAllowed=\"Yes\",IF(AND(G1008 = \"No\", C1008>D1008), \"Yes\", \"No\"),\"No\")","v":"Yes"},{"$f":"IF(SellAllowed=\"Yes\",IF(AND(G1008 = \"Yes\", C1008<E1008), \"Yes\", \"No\"),\"No\")","v":"No"},{"$f":"IF(I1008 = \"Yes\", M1007/(C1008+CostBuy), IF(J1008 = \"Yes\", 0, K1007))","v":113798.22450921089},null,{"$f":"IF(I1008 = \"Yes\", M1007-(C1008+CostBuy)*K1008, IF(J1008=\"Yes\", M1007+(C1008-CostSell)*K1007, M1007+K1008*Rate))","v":0}]
[null,1953.12,24.83,24.061666666666667,24.24,null,"Yes",null,{"$f":"IF(BuyAllowed=\"Yes\",IF(AND(G1009 = \"No\", C1009>D1009), \"Yes\", \"No\"),\"No\")","v":"No"},{"$f":"IF(SellAllowed=\"Yes\",IF(AND(G1009 = \"Yes\", C1009<E1009), \"Yes\", \"No\"),\"No\")","v":"No"},{"$f":"IF(I1009 = \"Yes\", M1008/(C1009+CostBuy), IF(J1009 = \"Yes\", 0, K1008))","v":113798.22450921089},null,{"$f":"IF(I1009 = \"Yes\", M1008-(C1009+CostBuy)*K1009, IF(J1009=\"Yes\", M1008+(C1009-CostSell)*K1008, M1008+K1009*Rate))","v":5689.9112254605452}]
[null,1954.01,25.46,24.208333333333332,24.254999999999995,null,"Yes",null,{"$f":"IF(BuyAllowed=\"Yes\",IF(AND(G1010 = \"No\", C1010>D1010), \"Yes\", \"No\"),\"No\")","v":"No"},{"$f":"IF(SellAllowed=\"Yes\",IF(AND(G1010 = \"Yes\", C1010<E1010), \"Yes\", \"No\"),\"No\")","v":"No"},{"$f":"IF(I1010 = \"Yes\", M1009/(C1010+CostBuy), IF(J1010 = \"Yes\", 0, K1009))","v":113798.22450921089},null,{"$f":"IF(I1010 = \"Yes\", M1009-(C1010+CostBuy)*K1010, IF(J1010=\"Yes\", M1009+(C1010-CostSell)*K1009, M1009+K1010*Rate))","v":11379.82245092109}]
[null,1954.02,26.02,24.403333333333332,24.3325,null,"Yes",null,{"$f":"IF(BuyAllowed=\"Yes\",IF(AND(G1011 = \"No\", C1011>D1011), \"Yes\", \"No\"),\"No\")","v":"No"},{"$f":"IF(SellAllowed=\"Yes\",IF(AND(G1011 = \"Yes\", C1011<E1011), \"Yes\", \"No\"),\"No\")","v":"No"},{"$f":"IF(I1011 = \"Yes\", M1010/(C1011+CostBuy), IF(J1011 = \"Yes\", 0, K1010))","v":113798.22450921089},null,{"$f":"IF(I1011 = \"Yes\", M1010-(C1011+CostBuy)*K1011, IF(J1011=\"Yes\", M1010+(C1011-CostSell)*K1010, M1010+K1011*Rate))","v":17069.733676381635}]
[null,1954.03,26.57,24.675000000000001,24.591250000000002,null,"Yes",null,{"$f":"IF(BuyAllowed=\"Yes\",IF(AND(G1012 = \"No\", C1012>D1012), \"Yes\", \"No\"),\"No\")","v":"No"},{"$f":"IF(SellAllowed=\"Yes\",IF(AND(G1012 = \"Yes\", C1012<E1012), \"Yes\", \"No\"),\"No\")","v":"No"},{"$f":"IF(I1012 = \"Yes\", M1011/(C1012+CostBuy), IF(J1012 = \"Yes\", 0, K1011))","v":113798.22450921089},null,{"$f":"IF(I1012 = \"Yes\", M1011-(C1012+CostBuy)*K1012, IF(J1012=\"Yes\", M1011+(C1012-CostSell)*K1011, M1011+K1012*Rate))","v":22759.644901842181}]
[null,1954.04,27.63,25.224999999999998,24.876249999999999,null,"Yes",null,{"$f":"IF(BuyAllowed=\"Yes\",IF(AND(G1013 = \"No\", C1013>D1013), \"Yes\", \"No\"),\"No\")","v":"No"},{"$f":"IF(SellAllowed=\"Yes\",IF(AND(G1013 = \"Yes\", C1013<E1013), \"Yes\", \"No\"),\"No\")","v":"No"},{"$f":"IF(I1013 = \"Yes\", M1012/(C1013+CostBuy), IF(J1013 = \"Yes\", 0, K1012))","v":113798.22450921089},null,{"$f":"IF(I1013 = \"Yes\", M1012-(C1013+CostBuy)*K1013, IF(J1013=\"Yes\", M1012+(C1013-CostSell)*K1012, M1012+K1013*Rate))","v":28449.556127302727}]
[null,1954.05,28.73,25.834999999999997,25.28125,null,"Yes",null,{"$f":"IF(BuyAllowed=\"Yes\",IF(AND(G1014 = \"No\", C1014>D1014), \"Yes\", \"No\"),\"No\")","v":"No"},{"$f":"IF(SellAllowed=\"Yes\",IF(AND(G1014 = \"Yes\", C1014<E1014), \"Yes\", \"No\"),\"No\")","v":"No"},{"$f":"IF(I1014 = \"Yes\", M1013/(C1014+CostBuy), IF(J1014 = \"Yes\", 0, K1013))","v":113798.22450921089},null,{"$f":"IF(I1014 = \"Yes\", M1013-(C1014+CostBuy)*K1014, IF(J1014=\"Yes\", M1013+(C1014-CostSell)*K1013, M1013+K1014*Rate))","v":34139.467352763269}]
[null,1954.06,28.96,26.539999999999996,25.963749999999997,null,"Yes",null,{"$f":"IF(BuyAllowed=\"Yes\",IF(AND(G1015 = \"No\", C1015>D1015), \"Yes\", \"No\"),\"No\")","v":"No"},{"$f":"IF(SellAllowed=\"Yes\",IF(AND(G1015 = \"Yes\", C1015<E1015), \"Yes\", \"No\"),\"No\")","v":"No"},{"$f":"IF(I1015 = \"Yes\", M1014/(C1015+CostBuy), IF(J1015 = \"Yes\", 0, K1014))","v":113798.22450921089},null,{"$f":"IF(I1015 = \"Yes\", M1014-(C1015+CostBuy)*K1015, IF(J1015=\"Yes\", M1014+(C1015-CostSell)*K1014, M1014+K1015*Rate))","v":39829.378578223812}]
[null,1954.07,30.13,27.228333333333335,26.587499999999999,null,"Yes",null,{"$f":"IF(BuyAllowed=\"Yes\",IF(AND(G1016 = \"No\", C1016>D1016), \"Yes\", \"No\"),\"No\")","v":"No"},{"$f":"IF(SellAllowed=\"Yes\",IF(AND(G1016 = \"Yes\", C1016<E1016), \"Yes\", \"No\"),\"No\")","v":"No"},{"$f":"IF(I1016 = \"Yes\", M1015/(C1016+CostBuy), IF(J1016 = \"Yes\", 0, K1015))","v":113798.22450921089},null,{"$f":"IF(I1016 = \"Yes\", M1015-(C1016+CostBuy)*K1016, IF(J1016=\"Yes\", M1015+(C1016-CostSell)*K1015, M1015+K1016*Rate))","v":45519.289803684354}]
[null,1954.08,30.73,28.006666666666664,27.291249999999998,null,"Yes",null,{"$f":"IF(BuyAllowed=\"Yes\",IF(AND(G1017 = \"No\", C1017>D1017), \"Yes\", \"No\"),\"No\")","v":"No"},{"$f":"IF(SellAllowed=\"Yes\",IF(AND(G1017 = \"Yes\", C1017<E1017), \"Yes\", \"No\"),\"No\")","v":"No"},{"$f":"IF(I1017 = \"Yes\", M1016/(C1017+CostBuy), IF(J1017 = \"Yes\", 0, K1016))","v":113798.22450921089},null,{"$f":"IF(I1017 = \"Yes\", M1016-(C1017+CostBuy)*K1017, IF(J1017=\"Yes\", M1016+(C1017-CostSell)*K1016, M1016+K1017*Rate))","v":51209.201029144897}]
[null,1954.09,31.45,28.791666666666668,28.028749999999999,null,"Yes",null,{"$f":"IF(BuyAllowed=\"Yes\",IF(AND(G1018 = \"No\", C1018>D1018), \"Yes\", \"No\"),\"No\")","v":"No"},{"$f":"IF(SellAllowed=\"Yes\",IF(AND(G1018 = \"Yes\", C1018<E1018), \"Yes\", \"No\"),\"No\")","v":"No"},{"$f":"IF(I1018 = \"Yes\", M1017/(C1018+CostBuy), IF(J1018 = \"Yes\", 0, K1017))","v":113798.22450921089},null,{"$f":"IF(I1018 = \"Yes\", M1017-(C1018+CostBuy)*K1018, IF(J1018=\"Yes\", M1017+(C1018-CostSell)*K1017, M1017+K1018*Rate))","v":56899.112254605439}]
[null,1954.1,32.18,29.604999999999993,28.777499999999996,null,"Yes",null,{"$f":"IF(BuyAllowed=\"Yes\",IF(AND(G1019 = \"No\", C1019>D1019), \"Yes\", \"No\"),\"No\")","v":"No"},{"$f":"IF(SellAllowed=\"Yes\",IF(AND(G1019 = \"Yes\", C1019<E1019), \"Yes\", \"No\"),\"No\")","v":"No"},{"$f":"IF(I1019 = \"Yes\", M1018/(C1019+CostBuy), IF(J1019 = \"Yes\", 0, K1018))","v":113798.22450921089},null,{"$f":"IF(I1019 = \"Yes\", M1018-(C1019+CostBuy)*K1019, IF(J1019=\"Yes\", M1018+(C1019-CostSell)*K1018, M1018+K1019*Rate))","v":62589.023480065982}]
[null,1954.11,33.44,30.363333333333333,29.547499999999999,null,"Yes",null,{"$f":"IF(BuyAllowed=\"Yes\",IF(AND(G1020 = \"No\", C1020>D1020), \"Yes\", \"No\"),\"No\")","v":"No"},{"$f":"IF(SellAllowed=\"Yes\",IF(AND(G1020 = \"Yes\", C1020<E1020), \"Yes\", \"No\"),\"No\")","v":"No"},{"$f":"IF(I1020 = \"Yes\", M1019/(C1020+CostBuy), IF(J1020 = \"Yes\", 0, K1019))","v":113798.22450921089},null,{"$f":"IF(I1020 = \"Yes\", M1019-(C1020+CostBuy)*K1020, IF(J1020=\"Yes\", M1019+(C1020-CostSell)*K1019, M1019+K1020*Rate))","v":68278.934705526524}]
[null,1954.12,34.97,31.148333333333337,30.406249999999996,null,"Yes",null,{"$f":"IF(BuyAllowed=\"Yes\",IF(AND(G1021 = \"No\", C1021>D1021), \"Yes\", \"No\"),\"No\")","v":"No"},{"$f":"IF(SellAllowed=\"Yes\",IF(AND(G1021 = \"Yes\", C1021<E1021), \"Yes\", \"No\"),\"No\")","v":"No"},{"$f":"IF(I1021 = \"Yes\", M1020/(C1021+CostBuy), IF(J1021 = \"Yes\", 0, K1020))","v":113798.22450921089},null,{"$f":"IF(I1021 = \"Yes\", M1020-(C1021+CostBuy)*K1021, IF(J1021=\"Yes\", M1020+(C1021-CostSell)*K1020, M1020+K1021*Rate))","v":73968.845930987067}]
[null,1955.01,35.6,32.15,31.32375,null,"Yes",null,{"$f":"IF(BuyAllowed=\"Yes\",IF(AND(G1022 = \"No\", C1022>D1022), \"Yes\", \"No\"),\"No\")","v":"No"},{"$f":"IF(SellAllowed=\"Yes\",IF(AND(G1022 = \"Yes\", C1022<E1022), \"Yes\", \"No\"),\"No\")","v":"No"},{"$f":"IF(I1022 = \"Yes\", M1021/(C1022+CostBuy), IF(J1022 = \"Yes\", 0, K1021))","v":113798.22450921089},null,{"$f":"IF(I1022 = \"Yes\", M1021-(C1022+CostBuy)*K1022, IF(J1022=\"Yes\", M1021+(C1022-CostSell)*K1021, M1021+K1022*Rate))","v":79658.757156447609}]
[null,1955.02,36.79,33.06166666666666,32.182500000000005,null,"Yes",null,{"$f":"IF(BuyAllowed=\"Yes\",IF(AND(G1023 = \"No\", C1023>D1023), \"Yes\", \"No\"),\"No\")","v":"No"},{"$f":"IF(SellAllowed=\"Yes\",IF(AND(G1023 = \"Yes\", C1023<E1023), \"Yes\", \"No\"),\"No\")","v":"No"},{"$f":"IF(I1023 = \"Yes\", M1022/(C1023+CostBuy), IF(J1023 = \"Yes\", 0, K1022))","v":113798.22450921089},null,{"$f":"IF(I1023 = \"Yes\", M1022-(C1023+CostBuy)*K1023, IF(J1023=\"Yes\", M1022+(C1023-CostSell)*K1022, M1022+K1023*Rate))","v":85348.668381908152}]
[null,1955.03,36.5,34.071666666666665,33.161250000000003,null,"Yes",null,{"$f":"IF(BuyAllowed=\"Yes\",IF(AND(G1024 = \"No\", C1024>D1024), \"Yes\", \"No\"),\"No\")","v":"No"},{"$f":"IF(SellAllowed=\"Yes\",IF(AND(G1024 = \"Yes\", C1024<E1024), \"Yes\", \"No\"),\"No\")","v":"No"},{"$f":"IF(I1024 = \"Yes\", M1023/(C1024+CostBuy), IF(J1024 = \"Yes\", 0, K1023))","v":113798.22450921089},null,{"$f":"IF(I1024 = \"Yes\", M1023-(C1024+CostBuy)*K1024, IF(J1024=\"Yes\", M1023+(C1024-CostSell)*K1023, M1023+K1024*Rate))","v":91038.579607368694}]
[null,1955.04,37.76,34.913333333333334,33.957499999999996,null,"Yes",null,{"$f":"IF(BuyAllowed=\"Yes\",IF(AND(G1025 = \"No\", C1025>D1025), \"Yes\", \"No\"),\"No\")","v":"No"},{"$f":"IF(SellAllowed=\"Yes\",IF(AND(G1025 = \"Yes\", C1025<E1025), \"Yes\", \"No\"),\"No\")","v":"No"},{"$f":"IF(I1025 = \"Yes\", M1024/(C1025+CostBuy), IF(J1025 = \"Yes\", 0, K1024))","v":113798.22450921089},null,{"$f":"IF(I1025 = \"Yes\", M1024-(C1025+CostBuy)*K1025, IF(J1025=\"Yes\", M1024+(C1025-CostSell)*K1024, M1024+K1025*Rate))","v":96728.490832829237}]
[null,1955.05,37.6,35.843333333333327,34.83625,null,"Yes",null,{"$f":"IF(BuyAllowed=\"Yes\",IF(AND(G1026 = \"No\", C1026>D1026), \"Yes\", \"No\"),\"No\")","v":"No"},{"$f":"IF(SellAllowed=\"Yes\",IF(AND(G1026 = \"Yes\", C1026<E1026), \"Yes\", \"No\"),\"No\")","v":"No"},{"$f":"IF(I1026 = \"Yes\", M1025/(C1026+CostBuy), IF(J1026 = \"Yes\", 0, K1025))","v":113798.22450921089},null,{"$f":"IF(I1026 = \"Yes\", M1025-(C1026+CostBuy)*K1026, IF(J1026=\"Yes\", M1025+(C1026-CostSell)*K1025, M1025+K1026*Rate))","v":102418.40205828978}]
[null,1955.06,39.78,36.536666666666662,35.604999999999997,null,"Yes",null,{"$f":"IF(BuyAllowed=\"Yes\",IF(AND(G1027 = \"No\", C1027>D1027), \"Yes\", \"No\"),\"No\")","v":"No"},{"$f":"IF(SellAllowed=\"Yes\",IF(AND(G1027 = \"Yes\", C1027<E1027), \"Yes\", \"No\"),\"No\")","v":"No"},{"$f":"IF(I1027 = \"Yes\", M1026/(C1027+CostBuy), IF(J1027 = \"Yes\", 0, K1026))","v":113798.22450921089},null,{"$f":"IF(I1027 = \"Yes\", M1026-(C1027+CostBuy)*K1027, IF(J1027=\"Yes\", M1026+(C1027-CostSell)*K1026, M1026+K1027*Rate))","v":108108.31328375032}]
[null,1955.07,42.69,37.338333333333331,36.554999999999993,null,"Yes",null,{"$f":"IF(BuyAllowed=\"Yes\",IF(AND(G1028 = \"No\", C1028>D1028), \"Yes\", \"No\"),\"No\")","v":"No"},{"$f":"IF(SellAllowed=\"Yes\",IF(AND(G1028 = \"Yes\", C1028<E1028), \"Yes\", \"No\"),\"No\")","v":"No"},{"$f":"IF(I1028 = \"Yes\", M1027/(C1028+CostBuy), IF(J1028 = \"Yes\", 0, K1027))","v":113798.22450921089},null,{"$f":"IF(I1028 = \"Yes\", M1027-(C1028+CostBuy)*K1028, IF(J1028=\"Yes\", M1027+(C1028-CostSell)*K1027, M1027+K1028*Rate))","v":113798.22450921086}]
[null,1955.08,42.43,38.519999999999996,37.71125,null,"Yes",null,{"$f":"IF(BuyAllowed=\"Yes\",IF(AND(G1029 = \"No\", C1029>D1029), \"Yes\", \"No\"),\"No\")","v":"No"},{"$f":"IF(SellAllowed=\"Yes\",IF(AND(G1029 = \"Yes\", C1029<E1029), \"Yes\", \"No\"),\"No\")","v":"No"},{"$f":"IF(I1029 = \"Yes\", M1028/(C1029+CostBuy), IF(J1029 = \"Yes\", 0, K1028))","v":113798.22450921089},null,{"$f":"IF(I1029 = \"Yes\", M1028-(C1029+CostBuy)*K1029, IF(J1029=\"Yes\", M1028+(C1029-CostSell)*K1028, M1028+K1029*Rate))","v":119488.13573467141}]
[null,1955.09,44.34,39.46,38.643750000000004,null,"Yes",null,{"$f":"IF(BuyAllowed=\"Yes\",IF(AND(G1030 = \"No\", C1030>D1030), \"Yes\", \"No\"),\"No\")","v":"No"},{"$f":"IF(SellAllowed=\"Yes\",IF(AND(G1030 = \"Yes\", C1030<E1030), \"Yes\", \"No\"),\"No\")","v":"No"},{"$f":"IF(I1030 = \"Yes\", M1029/(C1030+CostBuy), IF(J1030 = \"Yes\", 0, K1029))","v":113798.22450921089},null,{"$f":"IF(I1030 = \"Yes\", M1029-(C1030+CostBuy)*K1030, IF(J1030=\"Yes\", M1029+(C1030-CostSell)*K1029, M1029+K1030*Rate))","v":125178.04696013195}]
[null,1955.1,42.11,40.766666666666666,39.736249999999998,null,"Yes",null,{"$f":"IF(BuyAllowed=\"Yes\",IF(AND(G1031 = \"No\", C1031>D1031), \"Yes\", \"No\"),\"No\")","v":"No"},{"$f":"IF(SellAllowed=\"Yes\",IF(AND(G1031 = \"Yes\", C1031<E1031), \"Yes\", \"No\"),\"No\")","v":"No"},{"$f":"IF(I1031 = \"Yes\", M1030/(C1031+CostBuy), IF(J1031 = \"Yes\", 0, K1030))","v":113798.22450921089},null,{"$f":"IF(I1031 = \"Yes\", M1030-(C1031+CostBuy)*K1031, IF(J1031=\"Yes\", M1030+(C1031-CostSell)*K1030, M1030+K1031*Rate))","v":130867.95818559249}]
[null,1955.11,44.95,41.491666666666667,40.401250000000005,null,"Yes",null,{"$f":"IF(BuyAllowed=\"Yes\",IF(AND(G1032 = \"No\", C1032>D1032), \"Yes\", \"No\"),\"No\")","v":"No"},{"$f":"IF(SellAllowed=\"Yes\",IF(AND(G1032 = \"Yes\", C1032<E1032), \"Yes\", \"No\"),\"No\")","v":"No"},{"$f":"IF(I1032 = \"Yes\", M1031/(C1032+CostBuy), IF(J1032 = \"Yes\", 0, K1031))","v":113798.22450921089},null,{"$f":"IF(I1032 = \"Yes\", M1031-(C1032+CostBuy)*K1032, IF(J1032=\"Yes\", M1031+(C1032-CostSell)*K1031, M1031+K1032*Rate))","v":136557.86941105305}]
[null,1955.12,45.37,42.716666666666669,41.457499999999996,null,"Yes",null,{"$f":"IF(BuyAllowed=\"Yes\",IF(AND(G1033 = \"No\", C1033>D1033), \"Yes\", \"No\"),\"No\")","v":"No"},{"$f":"IF(SellAllowed=\"Yes\",IF(AND(G1033 = \"Yes\", C1033<E1033), \"Yes\", \"No\"),\"No\")","v":"No"},{"$f":"IF(I1033 = \"Yes\", M1032/(C1033+CostBuy), IF(J1033 = \"Yes\", 0, K1032))","v":113798.22450921089},null,{"$f":"IF(I1033 = \"Yes\", M1032-(C1033+CostBuy)*K1033, IF(J1033=\"Yes\", M1032+(C1033-CostSell)*K1032, M1032+K1033*Rate))","v":142247.78063651361}]
[null,1956.01,44.15,43.648333333333333,42.408749999999998,null,"Yes",null,{"$f":"IF(BuyAllowed=\"Yes\",IF(AND(G1034 = \"No\", C1034>D1034), \"Yes\", \"No\"),\"No\")","v":"No"},{"$f":"IF(SellAllowed=\"Yes\",IF(AND(G1034 = \"Yes\", C1034<E1034), \"Yes\", \"No\"),\"No\")","v":"No"},{"$f":"IF(I1034 = \"Yes\", M1033/(C1034+CostBuy), IF(J1034 = \"Yes\", 0, K1033))","v":113798.22450921089},null,{"$f":"IF(I1034 = \"Yes\", M1033-(C1034+CostBuy)*K1034, IF(J1034=\"Yes\", M1033+(C1034-CostSell)*K1033, M1033+K1034*Rate))","v":147937.69186197416}]
[null,1956.02,44.43,43.891666666666659,43.227499999999999,null,"Yes",null,{"$f":"IF(BuyAllowed=\"Yes\",IF(AND(G1035 = \"No\", C1035>D1035), \"Yes\", \"No\"),\"No\")","v":"No"},{"$f":"IF(SellAllowed=\"Yes\",IF(AND(G1035 = \"Yes\", C1035<E1035), \"Yes\", \"No\"),\"No\")","v":"No"},{"$f":"IF(I1035 = \"Yes\", M1034/(C1035+CostBuy), IF(J1035 = \"Yes\", 0, K1034))","v":113798.22450921089},null,{"$f":"IF(I1035 = \"Yes\", M1034-(C1035+CostBuy)*K1035, IF(J1035=\"Yes\", M1034+(C1035-CostSell)*K1034, M1034+K1035*Rate))","v":153627.60308743472}]
[null,1956.03,47.49,44.225000000000001,43.808749999999996,null,"Yes",null,{"$f":"IF(BuyAllowed=\"Yes\",IF(AND(G1036 = \"No\", C1036>D1036), \"Yes\", \"No\"),\"No\")","v":"No"},{"$f":"IF(SellAllowed=\"Yes\",IF(AND(G1036 = \"Yes\", C1036<E1036), \"Yes\", \"No\"),\"No\")","v":"No"},{"$f":"IF(I1036 = \"Yes\", M1035/(C1036+CostBuy), IF(J1036 = \"Yes\", 0, K1035))","v":113798.22450921089},null,{"$f":"IF(I1036 = \"Yes\", M1035-(C1036+CostBuy)*K1036, IF(J1036=\"Yes\", M1035+(C1036-CostSell)*K1035, M1035+K1036*Rate))","v":159317.51431289528}]
[null,1956.04,48.05,44.75,44.408749999999998,null,"Yes",null,{"$f":"IF(BuyAllowed=\"Yes\",IF(AND(G1037 = \"No\", C1037>D1037), \"Yes\", \"No\"),\"No\")","v":"No"},{"$f":"IF(SellAllowed=\"Yes\",IF(AND(G1037 = \"Yes\", C1037<E1037), \"Yes\", \"No\"),\"No\")","v":"No"},{"$f":"IF(I1037 = \"Yes\", M1036/(C1037+CostBuy), IF(J1037 = \"Yes\", 0, K1036))","v":113798.22450921089},null,{"$f":"IF(I1037 = \"Yes\", M1036-(C1037+CostBuy)*K1037, IF(J1037=\"Yes\", M1036+(C1037-CostSell)*K1036, M1036+K1037*Rate))","v":165007.42553835583}]
[null,1956.05,46.54,45.74,45.111250000000005,null,"Yes",null,{"$f":"IF(BuyAllowed=\"Yes\",IF(AND(G1038 = \"No\", C1038>D1038), \"Yes\", \"No\"),\"No\")","v":"No"},{"$f":"IF(SellAllowed=\"Yes\",IF(AND(G1038 = \"Yes\", C1038<E1038), \"Yes\", \"No\"),\"No\")","v":"No"},{"$f":"IF(I1038 = \"Yes\", M1037/(C1038+CostBuy), IF(J1038 = \"Yes\", 0, K1037))","v":113798.22450921089},null,{"$f":"IF(I1038 = \"Yes\", M1037-(C1038+CostBuy)*K1038, IF(J1038=\"Yes\", M1037+(C1038-CostSell)*K1037, M1037+K1038*Rate))","v":170697.33676381639}]
[null,1956.06,46.27,46.005000000000003,45.386250000000004,null,"Yes",null,{"$f":"IF(BuyAllowed=\"Yes\",IF(AND(G1039 = \"No\", C1039>D1039), \"Yes\", \"No\"),\"No\")","v":"No"},{"$f":"IF(SellAllowed=\"Yes\",IF(AND(G1039 = \"Yes\", C1039<E1039), \"Yes\", \"No\"),\"No\")","v":"No"},{"$f":"IF(I1039 = \"Yes\", M1038/(C1039+CostBuy), IF(J1039 = \"Yes\", 0, K1038))","v":113798.22450921089},null,{"$f":"IF(I1039 = \"Yes\", M1038-(C1039+CostBuy)*K1039, IF(J1039=\"Yes\", M1038+(C1039-CostSell)*K1038, M1038+K1039*Rate))","v":176387.24798927695}]
[null,1956.07,48.78,46.155000000000001,45.90625,null,"Yes",null,{"$f":"IF(BuyAllowed=\"Yes\",IF(AND(G1040 = \"No\", C1040>D1040), \"Yes\", \"No\"),\"No\")","v":"No"},{"$f":"IF(SellAllowed=\"Yes\",IF(AND(G1040 = \"Yes\", C1040<E1040), \"Yes\", \"No\"),\"No\")","v":"No"},{"$f":"IF(I1040 = \"Yes\", M1039/(C1040+CostBuy), IF(J1040 = \"Yes\", 0, K1039))","v":113798.22450921089},null,{"$f":"IF(I1040 = \"Yes\", M1039-(C1040+CostBuy)*K1040, IF(J1040=\"Yes\", M1039+(C1040-CostSell)*K1039, M1039+K1040*Rate))","v":182077.1592147375}]
[null,1956.08,48.49,46.926666666666669,46.385000000000005,null,"Yes",null,{"$f":"IF(BuyAllowed=\"Yes\",IF(AND(G1041 = \"No\", C1041>D1041), \"Yes\", \"No\"),\"No\")","v":"No"},{"$f":"IF(SellAllowed=\"Yes\",IF(AND(G1041 = \"Yes\", C1041<E1041), \"Yes\", \"No\"),\"No\")","v":"No"},{"$f":"IF(I1041 = \"Yes\", M1040/(C1041+CostBuy), IF(J1041 = \"Yes\", 0, K1040))","v":113798.22450921089},null,{"$f":"IF(I1041 = \"Yes\", M1040-(C1041+CostBuy)*K1041, IF(J1041=\"Yes\", M1040+(C1041-CostSell)*K1040, M1040+K1041*Rate))","v":187767.07044019806}]
[null,1956.09,46.84,47.603333333333332,46.775000000000006,null,"Yes",null,{"$f":"IF(BuyAllowed=\"Yes\",IF(AND(G1042 = \"No\", C1042>D1042), \"Yes\", \"No\"),\"No\")","v":"No"},{"$f":"IF(SellAllowed=\"Yes\",IF(AND(G1042 = \"Yes\", C1042<E1042), \"Yes\", \"No\"),\"No\")","v":"No"},{"$f":"IF(I1042 = \"Yes\", M1041/(C1042+CostBuy), IF(J1042 = \"Yes\", 0, K1041))","v":113798.22450921089},null,{"$f":"IF(I1042 = \"Yes\", M1041-(C1042+CostBuy)*K1042, IF(J1042=\"Yes\", M1041+(C1042-CostSell)*K1041, M1041+K1042*Rate))","v":193456.98166565862}]
[null,1956.1,46.24,47.495000000000005,47.111249999999998,null,"Yes",null,{"$f":"IF(BuyAllowed=\"Yes\",IF(AND(G1043 = \"No\", C1043>D1043), \"Yes\", \"No\"),\"No\")","v":"No"},{"$f":"IF(SellAllowed=\"Yes\",IF(AND(G1043 = \"Yes\", C1043<E1043), \"Yes\", \"No\"),\"No\")","v":"Yes"},{"$f":"IF(I1043 = \"Yes\", M1042/(C1043+CostBuy), IF(J1043 = \"Yes\", 0, K1042))","v":0},null,{"$f":"IF(I1043 = \"Yes\", M1042-(C1043+CostBuy)*K1043, IF(J1043=\"Yes\", M1042+(C1043-CostSell)*K1042, M1042+K1043*Rate))","v":5448658.9895010181}]
[null,1956.11,45.76,47.193333333333335,47.337500000000006,null,"No",null,{"$f":"IF(BuyAllowed=\"Yes\",IF(AND(G1044 = \"No\", C1044>D1044), \"Yes\", \"No\"),\"No\")","v":"No"},{"$f":"IF(SellAllowed=\"Yes\",IF(AND(G1044 = \"Yes\", C1044<E1044), \"Yes\", \"No\"),\"No\")","v":"No"},{"$f":"IF(I1044 = \"Yes\", M1043/(C1044+CostBuy), IF(J1044 = \"Yes\", 0, K1043))","v":0},null,{"$f":"IF(I1044 = \"Yes\", M1043-(C1044+CostBuy)*K1044, IF(J1044=\"Yes\", M1043+(C1044-CostSell)*K1043, M1043+K1044*Rate))","v":5448658.9895010181}]
[null,1956.12,46.44,47.06333333333334,47.121250000000003,null,"No",null,{"$f":"IF(BuyAllowed=\"Yes\",IF(AND(G1045 = \"No\", C1045>D1045), \"Yes\", \"No\"),\"No\")","v":"No"},{"$f":"IF(SellAllowed=\"Yes\",IF(AND(G1045 = \"Yes\", C1045<E1045), \"Yes\", \"No\"),\"No\")","v":"No"},{"$f":"IF(I1045 = \"Yes\", M1044/(C1045+CostBuy), IF(J1045 = \"Yes\", 0, K1044))","v":0},null,{"$f":"IF(I1045 = \"Yes\", M1044-(C1045+CostBuy)*K1045, IF(J1045=\"Yes\", M1044+(C1045-CostSell)*K1044, M1044+K1045*Rate))","v":5448658.9895010181}]
[null,1957.01,45.43,47.091666666666669,46.92,null,"No",null,{"$f":"IF(BuyAllowed=\"Yes\",IF(AND(G1046 = \"No\", C1046>D1046), \"Yes\", \"No\"),\"No\")","v":"No"},{"$f":"IF(SellAllowed=\"Yes\",IF(AND(G1046 = \"Yes\", C1046<E1046), \"Yes\", \"No\"),\"No\")","v":"No"},{"$f":"IF(I1046 = \"Yes\", M1045/(C1046+CostBuy), IF(J1046 = \"Yes\", 0, K1045))","v":0},null,{"$f":"IF(I1046 = \"Yes\", M1045-(C1046+CostBuy)*K1046, IF(J1046=\"Yes\", M1045+(C1046-CostSell)*K1045, M1045+K1046*Rate))","v":5448658.9895010181}]
[null,1957.02,43.47,46.533333333333331,46.781250000000007,null,"No",null,{"$f":"IF(BuyAllowed=\"Yes\",IF(AND(G1047 = \"No\", C1047>D1047), \"Yes\", \"No\"),\"No\")","v":"No"},{"$f":"IF(SellAllowed=\"Yes\",IF(AND(G1047 = \"Yes\", C1047<E1047), \"Yes\", \"No\"),\"No\")","v":"No"},{"$f":"IF(I1047 = \"Yes\", M1046/(C1047+CostBuy), IF(J1047 = \"Yes\", 0, K1046))","v":0},null,{"$f":"IF(I1047 = \"Yes\", M1046-(C1047+CostBuy)*K1047, IF(J1047=\"Yes\", M1046+(C1047-CostSell)*K1046, M1046+K1047*Rate))","v":5448658.9895010181}]
[null,1957.03,44.03,45.696666666666665,46.431250000000006,null,"No",null,{"$f":"IF(BuyAllowed=\"Yes\",IF(AND(G1048 = \"No\", C1048>D1048), \"Yes\", \"No\"),\"No\")","v":"No"},{"$f":"IF(SellAllowed=\"Yes\",IF(AND(G1048 = \"Yes\", C1048<E1048), \"Yes\", \"No\"),\"No\")","v":"No"},{"$f":"IF(I1048 = \"Yes\", M1047/(C1048+CostBuy), IF(J1048 = \"Yes\", 0, K1047))","v":0},null,{"$f":"IF(I1048 = \"Yes\", M1047-(C1048+CostBuy)*K1048, IF(J1048=\"Yes\", M1047+(C1048-CostSell)*K1047, M1047+K1048*Rate))","v":5448658.9895010181}]
[null,1957.04,45.05,45.228333333333332,45.837499999999991,null,"No",null,{"$f":"IF(BuyAllowed=\"Yes\",IF(AND(G1049 = \"No\", C1049>D1049), \"Yes\", \"No\"),\"No\")","v":"No"},{"$f":"IF(SellAllowed=\"Yes\",IF(AND(G1049 = \"Yes\", C1049<E1049), \"Yes\", \"No\"),\"No\")","v":"No"},{"$f":"IF(I1049 = \"Yes\", M1048/(C1049+CostBuy), IF(J1049 = \"Yes\", 0, K1048))","v":0},null,{"$f":"IF(I1049 = \"Yes\", M1048-(C1049+CostBuy)*K1049, IF(J1049=\"Yes\", M1048+(C1049-CostSell)*K1048, M1048+K1049*Rate))","v":5448658.9895010181}]
[null,1957.05,46.78,45.03,45.407500000000006,null,"No",null,{"$f":"IF(BuyAllowed=\"Yes\",IF(AND(G1050 = \"No\", C1050>D1050), \"Yes\", \"No\"),\"No\")","v":"Yes"},{"$f":"IF(SellAllowed=\"Yes\",IF(AND(G1050 = \"Yes\", C1050<E1050), \"Yes\", \"No\"),\"No\")","v":"No"},{"$f":"IF(I1050 = \"Yes\", M1049/(C1050+CostBuy), IF(J1050 = \"Yes\", 0, K1049))","v":116399.46570179486},null,{"$f":"IF(I1050 = \"Yes\", M1049-(C1050+CostBuy)*K1050, IF(J1050=\"Yes\", M1049+(C1050-CostSell)*K1049, M1049+K1050*Rate))","v":0}]
[null,1957.06,47.55,{"$f":"AVERAGE(C1045:C1050)","v":45.20000000000001},{"$f":"AVERAGE(C1043:C1050)","v":45.400000000000006},null,"Yes",null,{"$f":"IF(BuyAllowed=\"Yes\",IF(AND(G1051 = \"No\", C1051>D1051), \"Yes\", \"No\"),\"No\")","v":"No"},{"$f":"IF(SellAllowed=\"Yes\",IF(AND(G1051 = \"Yes\", C1051<E1051), \"Yes\", \"No\"),\"No\")","v":"No"},{"$f":"IF(I1051 = \"Yes\", M1050/(C1051+CostBuy), IF(J1051 = \"Yes\", 0, K1050))","v":116399.46570179486},null,{"$f":"IF(I1051 = \"Yes\", M1050-(C1051+CostBuy)*K1051, IF(J1051=\"Yes\", M1050+(C1051-CostSell)*K1050, M1050+K1051*Rate))","v":5819.9732850897435}]
[null,1957.07,48.51,45.384999999999998,45.563750000000006,null,{"$f":"IF(I1051 = \"Yes\", \"Yes\", IF(J1051=\"Yes\", \"No\", G1051))","v":"Yes"},null,{"$f":"IF(BuyAllowed=\"Yes\",IF(AND(G1052 = \"No\", C1052>D1052), \"Yes\", \"No\"),\"No\")","v":"No"},{"$f":"IF(SellAllowed=\"Yes\",IF(AND(G1052 = \"Yes\", C1052<E1052), \"Yes\", \"No\"),\"No\")","v":"No"},{"$f":"IF(I1052 = \"Yes\", M1051/(C1052+CostBuy), IF(J1052 = \"Yes\", 0, K1051))","v":116399.46570179486},null,{"$f":"IF(I1052 = \"Yes\", M1051-(C1052+CostBuy)*K1052, IF(J1052=\"Yes\", M1051+(C1052-CostSell)*K1051, M1051+K1052*Rate))","v":11639.946570179487}]
[null,1957.08,45.84,45.898333333333333,45.907500000000006,null,"Yes",null,{"$f":"IF(BuyAllowed=\"Yes\",IF(AND(G1053 = \"No\", C1053>D1053), \"Yes\", \"No\"),\"No\")","v":"No"},{"$f":"IF(SellAllowed=\"Yes\",IF(AND(G1053 = \"Yes\", C1053<E1053), \"Yes\", \"No\"),\"No\")","v":"Yes"},{"$f":"IF(I1053 = \"Yes\", M1052/(C1053+CostBuy), IF(J1053 = \"Yes\", 0, K1052))","v":0},null,{"$f":"IF(I1053 = \"Yes\", M1052-(C1053+CostBuy)*K1053, IF(J1053=\"Yes\", M1052+(C1053-CostSell)*K1052, M1052+K1053*Rate))","v":5340407.4863983486}]
[null,1957.09,43.98,46.293333333333329,45.832499999999996,null,"No",null,{"$f":"IF(BuyAllowed=\"Yes\",IF(AND(G1054 = \"No\", C1054>D1054), \"Yes\", \"No\"),\"No\")","v":"No"},{"$f":"IF(SellAllowed=\"Yes\",IF(AND(G1054 = \"Yes\", C1054<E1054), \"Yes\", \"No\"),\"No\")","v":"No"},{"$f":"IF(I1054 = \"Yes\", M1053/(C1054+CostBuy), IF(J1054 = \"Yes\", 0, K1053))","v":0},null,{"$f":"IF(I1054 = \"Yes\", M1053-(C1054+CostBuy)*K1054, IF(J1054=\"Yes\", M1053+(C1054-CostSell)*K1053, M1053+K1054*Rate))","v":5340407.4863983486}]
[null,1957.1,41.24,46.284999999999997,45.651250000000005,null,"No",null,{"$f":"IF(BuyAllowed=\"Yes\",IF(AND(G1055 = \"No\", C1055>D1055), \"Yes\", \"No\"),\"No\")","v":"No"},{"$f":"IF(SellAllowed=\"Yes\",IF(AND(G1055 = \"Yes\", C1055<E1055), \"Yes\", \"No\"),\"No\")","v":"No"},{"$f":"IF(I1055 = \"Yes\", M1054/(C1055+CostBuy), IF(J1055 = \"Yes\", 0, K1054))","v":0},null,{"$f":"IF(I1055 = \"Yes\", M1054-(C1055+CostBuy)*K1055, IF(J1055=\"Yes\", M1054+(C1055-CostSell)*K1054, M1054+K1055*Rate))","v":5340407.4863983486}]
[null,1957.11,40.35,45.65,45.372500000000002,null,"No",null,{"$f":"IF(BuyAllowed=\"Yes\",IF(AND(G1056 = \"No\", C1056>D1056), \"Yes\", \"No\"),\"No\")","v":"No"},{"$f":"IF(SellAllowed=\"Yes\",IF(AND(G1056 = \"Yes\", C1056<E1056), \"Yes\", \"No\"),\"No\")","v":"No"},{"$f":"IF(I1056 = \"Yes\", M1055/(C1056+CostBuy), IF(J1056 = \"Yes\", 0, K1055))","v":0},null,{"$f":"IF(I1056 = \"Yes\", M1055-(C1056+CostBuy)*K1056, IF(J1056=\"Yes\", M1055+(C1056-CostSell)*K1055, M1055+K1056*Rate))","v":5340407.4863983486}]
[null,1957.12,40.33,44.57833333333334,44.912500000000001,null,"No",null,{"$f":"IF(BuyAllowed=\"Yes\",IF(AND(G1057 = \"No\", C1057>D1057), \"Yes\", \"No\"),\"No\")","v":"No"},{"$f":"IF(SellAllowed=\"Yes\",IF(AND(G1057 = \"Yes\", C1057<E1057), \"Yes\", \"No\"),\"No\")","v":"No"},{"$f":"IF(I1057 = \"Yes\", M1056/(C1057+CostBuy), IF(J1057 = \"Yes\", 0, K1056))","v":0},null,{"$f":"IF(I1057 = \"Yes\", M1056-(C1057+CostBuy)*K1057, IF(J1057=\"Yes\", M1056+(C1057-CostSell)*K1056, M1056+K1057*Rate))","v":5340407.4863983486}]
[null,1958.01,41.12,43.375,44.322499999999998,null,"No",null,{"$f":"IF(BuyAllowed=\"Yes\",IF(AND(G1058 = \"No\", C1058>D1058), \"Yes\", \"No\"),\"No\")","v":"No"},{"$f":"IF(SellAllowed=\"Yes\",IF(AND(G1058 = \"Yes\", C1058<E1058), \"Yes\", \"No\"),\"No\")","v":"No"},{"$f":"IF(I1058 = \"Yes\", M1057/(C1058+CostBuy), IF(J1058 = \"Yes\", 0, K1057))","v":0},null,{"$f":"IF(I1058 = \"Yes\", M1057-(C1058+CostBuy)*K1058, IF(J1058=\"Yes\", M1057+(C1058-CostSell)*K1057, M1057+K1058*Rate))","v":5340407.4863983486}]
[null,1958.02,41.26,42.143333333333338,43.615000000000002,null,"No",null,{"$f":"IF(BuyAllowed=\"Yes\",IF(AND(G1059 = \"No\", C1059>D1059), \"Yes\", \"No\"),\"No\")","v":"No"},{"$f":"IF(SellAllowed=\"Yes\",IF(AND(G1059 = \"Yes\", C1059<E1059), \"Yes\", \"No\"),\"No\")","v":"No"},{"$f":"IF(I1059 = \"Yes\", M1058/(C1059+CostBuy), IF(J1059 = \"Yes\", 0, K1058))","v":0},null,{"$f":"IF(I1059 = \"Yes\", M1058-(C1059+CostBuy)*K1059, IF(J1059=\"Yes\", M1058+(C1059-CostSell)*K1058, M1058+K1059*Rate))","v":5340407.4863983486}]
[null,1958.03,42.11,41.379999999999995,42.828749999999999,null,"No",null,{"$f":"IF(BuyAllowed=\"Yes\",IF(AND(G1060 = \"No\", C1060>D1060), \"Yes\", \"No\"),\"No\")","v":"Yes"},{"$f":"IF(SellAllowed=\"Yes\",IF(AND(G1060 = \"Yes\", C1060<E1060), \"Yes\", \"No\"),\"No\")","v":"No"},{"$f":"IF(I1060 = \"Yes\", M1059/(C1060+CostBuy), IF(J1060 = \"Yes\", 0, K1059))","v":126730.1254484658},null,{"$f":"IF(I1060 = \"Yes\", M1059-(C1060+CostBuy)*K1060, IF(J1060=\"Yes\", M1059+(C1060-CostSell)*K1059, M1059+K1060*Rate))","v":0}]
[null,1958.04,42.34,41.068333333333328,42.028750000000002,null,"Yes",null,{"$f":"IF(BuyAllowed=\"Yes\",IF(AND(G1061 = \"No\", C1061>D1061), \"Yes\", \"No\"),\"No\")","v":"No"},{"$f":"IF(SellAllowed=\"Yes\",IF(AND(G1061 = \"Yes\", C1061<E1061), \"Yes\", \"No\"),\"No\")","v":"No"},{"$f":"IF(I1061 = \"Yes\", M1060/(C1061+CostBuy), IF(J1061 = \"Yes\", 0, K1060))","v":126730.1254484658},null,{"$f":"IF(I1061 = \"Yes\", M1060-(C1061+CostBuy)*K1061, IF(J1061=\"Yes\", M1060+(C1061-CostSell)*K1060, M1060+K1061*Rate))","v":6336.5062724232903}]
[null,1958.05,43.7,41.251666666666672,41.591250000000002,null,"Yes",null,{"$f":"IF(BuyAllowed=\"Yes\",IF(AND(G1062 = \"No\", C1062>D1062), \"Yes\", \"No\"),\"No\")","v":"No"},{"$f":"IF(SellAllowed=\"Yes\",IF(AND(G1062 = \"Yes\", C1062<E1062), \"Yes\", \"No\"),\"No\")","v":"No"},{"$f":"IF(I1062 = \"Yes\", M1061/(C1062+CostBuy), IF(J1062 = \"Yes\", 0, K1061))","v":126730.1254484658},null,{"$f":"IF(I1062 = \"Yes\", M1061-(C1062+CostBuy)*K1062, IF(J1062=\"Yes\", M1061+(C1062-CostSell)*K1061, M1061+K1062*Rate))","v":12673.012544846581}]
[null,1958.06,44.75,41.81,41.556249999999999,null,"Yes",null,{"$f":"IF(BuyAllowed=\"Yes\",IF(AND(G1063 = \"No\", C1063>D1063), \"Yes\", \"No\"),\"No\")","v":"No"},{"$f":"IF(SellAllowed=\"Yes\",IF(AND(G1063 = \"Yes\", C1063<E1063), \"Yes\", \"No\"),\"No\")","v":"No"},{"$f":"IF(I1063 = \"Yes\", M1062/(C1063+CostBuy), IF(J1063 = \"Yes\", 0, K1062))","v":126730.1254484658},null,{"$f":"IF(I1063 = \"Yes\", M1062-(C1063+CostBuy)*K1063, IF(J1063=\"Yes\", M1062+(C1063-CostSell)*K1062, M1062+K1063*Rate))","v":19009.518817269869}]
[null,1958.07,45.98,42.54666666666666,41.995000000000005,null,"Yes",null,{"$f":"IF(BuyAllowed=\"Yes\",IF(AND(G1064 = \"No\", C1064>D1064), \"Yes\", \"No\"),\"No\")","v":"No"},{"$f":"IF(SellAllowed=\"Yes\",IF(AND(G1064 = \"Yes\", C1064<E1064), \"Yes\", \"No\"),\"No\")","v":"No"},{"$f":"IF(I1064 = \"Yes\", M1063/(C1064+CostBuy), IF(J1064 = \"Yes\", 0, K1063))","v":126730.1254484658},null,{"$f":"IF(I1064 = \"Yes\", M1063-(C1064+CostBuy)*K1064, IF(J1064=\"Yes\", M1063+(C1064-CostSell)*K1063, M1063+K1064*Rate))","v":25346.025089693161}]
[null,1958.08,47.7,43.356666666666676,42.698750000000004,null,"Yes",null,{"$f":"IF(BuyAllowed=\"Yes\",IF(AND(G1065 = \"No\", C1065>D1065), \"Yes\", \"No\"),\"No\")","v":"No"},{"$f":"IF(SellAllowed=\"Yes\",IF(AND(G1065 = \"Yes\", C1065<E1065), \"Yes\", \"No\"),\"No\")","v":"No"},{"$f":"IF(I1065 = \"Yes\", M1064/(C1065+CostBuy), IF(J1065 = \"Yes\", 0, K1064))","v":126730.1254484658},null,{"$f":"IF(I1065 = \"Yes\", M1064-(C1065+CostBuy)*K1065, IF(J1065=\"Yes\", M1064+(C1065-CostSell)*K1064, M1064+K1065*Rate))","v":31682.531362116453}]
[null,1958.09,48.96,44.43,43.62,null,"Yes",null,{"$f":"IF(BuyAllowed=\"Yes\",IF(AND(G1066 = \"No\", C1066>D1066), \"Yes\", \"No\"),\"No\")","v":"No"},{"$f":"IF(SellAllowed=\"Yes\",IF(AND(G1066 = \"Yes\", C1066<E1066), \"Yes\", \"No\"),\"No\")","v":"No"},{"$f":"IF(I1066 = \"Yes\", M1065/(C1066+CostBuy), IF(J1066 = \"Yes\", 0, K1065))","v":126730.1254484658},null,{"$f":"IF(I1066 = \"Yes\", M1065-(C1066+CostBuy)*K1066, IF(J1066=\"Yes\", M1065+(C1066-CostSell)*K1065, M1065+K1066*Rate))","v":38019.037634539745}]
[null,1958.1,50.95,45.571666666666665,44.6,null,"Yes",null,{"$f":"IF(BuyAllowed=\"Yes\",IF(AND(G1067 = \"No\", C1067>D1067), \"Yes\", \"No\"),\"No\")","v":"No"},{"$f":"IF(SellAllowed=\"Yes\",IF(AND(G1067 = \"Yes\", C1067<E1067), \"Yes\", \"No\"),\"No\")","v":"No"},{"$f":"IF(I1067 = \"Yes\", M1066/(C1067+CostBuy), IF(J1067 = \"Yes\", 0, K1066))","v":126730.1254484658},null,{"$f":"IF(I1067 = \"Yes\", M1066-(C1067+CostBuy)*K1067, IF(J1067=\"Yes\", M1066+(C1067-CostSell)*K1066, M1066+K1067*Rate))","v":44355.543906963037}]
[null,1958.11,52.5,47.006666666666668,45.811249999999994,null,"Yes",null,{"$f":"IF(BuyAllowed=\"Yes\",IF(AND(G1068 = \"No\", C1068>D1068), \"Yes\", \"No\"),\"No\")","v":"No"},{"$f":"IF(SellAllowed=\"Yes\",IF(AND(G1068 = \"Yes\", C1068<E1068), \"Yes\", \"No\"),\"No\")","v":"No"},{"$f":"IF(I1068 = \"Yes\", M1067/(C1068+CostBuy), IF(J1068 = \"Yes\", 0, K1067))","v":126730.1254484658},null,{"$f":"IF(I1068 = \"Yes\", M1067-(C1068+CostBuy)*K1068, IF(J1068=\"Yes\", M1067+(C1068-CostSell)*K1067, M1067+K1068*Rate))","v":50692.05017938633}]
[null,1958.12,53.49,48.473333333333336,47.11,null,"Yes",null,{"$f":"IF(BuyAllowed=\"Yes\",IF(AND(G1069 = \"No\", C1069>D1069), \"Yes\", \"No\"),\"No\")","v":"No"},{"$f":"IF(SellAllowed=\"Yes\",IF(AND(G1069 = \"Yes\", C1069<E1069), \"Yes\", \"No\"),\"No\")","v":"No"},{"$f":"IF(I1069 = \"Yes\", M1068/(C1069+CostBuy), IF(J1069 = \"Yes\", 0, K1068))","v":126730.1254484658},null,{"$f":"IF(I1069 = \"Yes\", M1068-(C1069+CostBuy)*K1069, IF(J1069=\"Yes\", M1068+(C1069-CostSell)*K1068, M1068+K1069*Rate))","v":57028.556451809622}]
[null,1959.01,55.62,49.930000000000007,48.503750000000004,null,"Yes",null,{"$f":"IF(BuyAllowed=\"Yes\",IF(AND(G1070 = \"No\", C1070>D1070), \"Yes\", \"No\"),\"No\")","v":"No"},{"$f":"IF(SellAllowed=\"Yes\",IF(AND(G1070 = \"Yes\", C1070<E1070), \"Yes\", \"No\"),\"No\")","v":"No"},{"$f":"IF(I1070 = \"Yes\", M1069/(C1070+CostBuy), IF(J1070 = \"Yes\", 0, K1069))","v":126730.1254484658},null,{"$f":"IF(I1070 = \"Yes\", M1069-(C1070+CostBuy)*K1070, IF(J1070=\"Yes\", M1069+(C1070-CostSell)*K1069, M1069+K1070*Rate))","v":63365.062724232914}]
[null,1959.02,54.77,51.536666666666669,49.993750000000006,null,"Yes",null,{"$f":"IF(BuyAllowed=\"Yes\",IF(AND(G1071 = \"No\", C1071>D1071), \"Yes\", \"No\"),\"No\")","v":"No"},{"$f":"IF(SellAllowed=\"Yes\",IF(AND(G1071 = \"Yes\", C1071<E1071), \"Yes\", \"No\"),\"No\")","v":"No"},{"$f":"IF(I1071 = \"Yes\", M1070/(C1071+CostBuy), IF(J1071 = \"Yes\", 0, K1070))","v":126730.1254484658},null,{"$f":"IF(I1071 = \"Yes\", M1070-(C1071+CostBuy)*K1071, IF(J1071=\"Yes\", M1070+(C1071-CostSell)*K1070, M1070+K1071*Rate))","v":69701.568996656206}]
[null,1959.03,56.16,52.714999999999996,51.246250000000003,null,"Yes",null,{"$f":"IF(BuyAllowed=\"Yes\",IF(AND(G1072 = \"No\", C1072>D1072), \"Yes\", \"No\"),\"No\")","v":"No"},{"$f":"IF(SellAllowed=\"Yes\",IF(AND(G1072 = \"Yes\", C1072<E1072), \"Yes\", \"No\"),\"No\")","v":"No"},{"$f":"IF(I1072 = \"Yes\", M1071/(C1072+CostBuy), IF(J1072 = \"Yes\", 0, K1071))","v":126730.1254484658},null,{"$f":"IF(I1072 = \"Yes\", M1071-(C1072+CostBuy)*K1072, IF(J1072=\"Yes\", M1071+(C1072-CostSell)*K1071, M1071+K1072*Rate))","v":76038.075269079491}]
[null,1959.04,57.1,53.914999999999999,52.518749999999997,null,"Yes",null,{"$f":"IF(BuyAllowed=\"Yes\",IF(AND(G1073 = \"No\", C1073>D1073), \"Yes\", \"No\"),\"No\")","v":"No"},{"$f":"IF(SellAllowed=\"Yes\",IF(AND(G1073 = \"Yes\", C1073<E1073), \"Yes\", \"No\"),\"No\")","v":"No"},{"$f":"IF(I1073 = \"Yes\", M1072/(C1073+CostBuy), IF(J1073 = \"Yes\", 0, K1072))","v":126730.1254484658},null,{"$f":"IF(I1073 = \"Yes\", M1072-(C1073+CostBuy)*K1073, IF(J1073=\"Yes\", M1072+(C1073-CostSell)*K1072, M1072+K1073*Rate))","v":82374.581541502776}]
[null,1959.05,57.96,54.940000000000005,53.693749999999994,null,"Yes",null,{"$f":"IF(BuyAllowed=\"Yes\",IF(AND(G1074 = \"No\", C1074>D1074), \"Yes\", \"No\"),\"No\")","v":"No"},{"$f":"IF(SellAllowed=\"Yes\",IF(AND(G1074 = \"Yes\", C1074<E1074), \"Yes\", \"No\"),\"No\")","v":"No"},{"$f":"IF(I1074 = \"Yes\", M1073/(C1074+CostBuy), IF(J1074 = \"Yes\", 0, K1073))","v":126730.1254484658},null,{"$f":"IF(I1074 = \"Yes\", M1073-(C1074+CostBuy)*K1074, IF(J1074=\"Yes\", M1073+(C1074-CostSell)*K1073, M1073+K1074*Rate))","v":88711.08781392606}]
[null,1959.06,57.46,55.849999999999994,54.818750000000001,null,"Yes",null,{"$f":"IF(BuyAllowed=\"Yes\",IF(AND(G1075 = \"No\", C1075>D1075), \"Yes\", \"No\"),\"No\")","v":"No"},{"$f":"IF(SellAllowed=\"Yes\",IF(AND(G1075 = \"Yes\", C1075<E1075), \"Yes\", \"No\"),\"No\")","v":"No"},{"$f":"IF(I1075 = \"Yes\", M1074/(C1075+CostBuy), IF(J1075 = \"Yes\", 0, K1074))","v":126730.1254484658},null,{"$f":"IF(I1075 = \"Yes\", M1074-(C1075+CostBuy)*K1075, IF(J1075=\"Yes\", M1074+(C1075-CostSell)*K1074, M1074+K1075*Rate))","v":95047.594086349345}]
[null,1959.07,59.74,56.511666666666663,55.6325,null,"Yes",null,{"$f":"IF(BuyAllowed=\"Yes\",IF(AND(G1076 = \"No\", C1076>D1076), \"Yes\", \"No\"),\"No\")","v":"No"},{"$f":"IF(SellAllowed=\"Yes\",IF(AND(G1076 = \"Yes\", C1076<E1076), \"Yes\", \"No\"),\"No\")","v":"No"},{"$f":"IF(I1076 = \"Yes\", M1075/(C1076+CostBuy), IF(J1076 = \"Yes\", 0, K1075))","v":126730.1254484658},null,{"$f":"IF(I1076 = \"Yes\", M1075-(C1076+CostBuy)*K1076, IF(J1076=\"Yes\", M1075+(C1076-CostSell)*K1075, M1075+K1076*Rate))","v":101384.10035877263}]
[null,1959.08,59.4,57.198333333333331,56.537499999999994,null,"Yes",null,{"$f":"IF(BuyAllowed=\"Yes\",IF(AND(G1077 = \"No\", C1077>D1077), \"Yes\", \"No\"),\"No\")","v":"No"},{"$f":"IF(SellAllowed=\"Yes\",IF(AND(G1077 = \"Yes\", C1077<E1077), \"Yes\", \"No\"),\"No\")","v":"No"},{"$f":"IF(I1077 = \"Yes\", M1076/(C1077+CostBuy), IF(J1077 = \"Yes\", 0, K1076))","v":126730.1254484658},null,{"$f":"IF(I1077 = \"Yes\", M1076-(C1077+CostBuy)*K1077, IF(J1077=\"Yes\", M1076+(C1077-CostSell)*K1076, M1076+K1077*Rate))","v":107720.60663119591}]
[null,1959.09,57.05,57.97,57.276249999999997,null,"Yes",null,{"$f":"IF(BuyAllowed=\"Yes\",IF(AND(G1078 = \"No\", C1078>D1078), \"Yes\", \"No\"),\"No\")","v":"No"},{"$f":"IF(SellAllowed=\"Yes\",IF(AND(G1078 = \"Yes\", C1078<E1078), \"Yes\", \"No\"),\"No\")","v":"Yes"},{"$f":"IF(I1078 = \"Yes\", M1077/(C1078+CostBuy), IF(J1078 = \"Yes\", 0, K1077))","v":0},null,{"$f":"IF(I1078 = \"Yes\", M1077-(C1078+CostBuy)*K1078, IF(J1078=\"Yes\", M1077+(C1078-CostSell)*K1077, M1077+K1078*Rate))","v":7330070.4559392612}]
[null,1959.1,57,58.118333333333339,57.454999999999998,null,"No",null,{"$f":"IF(BuyAllowed=\"Yes\",IF(AND(G1079 = \"No\", C1079>D1079), \"Yes\", \"No\"),\"No\")","v":"No"},{"$f":"IF(SellAllowed=\"Yes\",IF(AND(G1079 = \"Yes\", C1079<E1079), \"Yes\", \"No\"),\"No\")","v":"No"},{"$f":"IF(I1079 = \"Yes\", M1078/(C1079+CostBuy), IF(J1079 = \"Yes\", 0, K1078))","v":0},null,{"$f":"IF(I1079 = \"Yes\", M1078-(C1079+CostBuy)*K1079, IF(J1079=\"Yes\", M1078+(C1079-CostSell)*K1078, M1078+K1079*Rate))","v":7330070.4559392612}]
[null,1959.11,57.23,58.101666666666667,57.733750000000001,null,"No",null,{"$f":"IF(BuyAllowed=\"Yes\",IF(AND(G1080 = \"No\", C1080>D1080), \"Yes\", \"No\"),\"No\")","v":"No"},{"$f":"IF(SellAllowed=\"Yes\",IF(AND(G1080 = \"Yes\", C1080<E1080), \"Yes\", \"No\"),\"No\")","v":"No"},{"$f":"IF(I1080 = \"Yes\", M1079/(C1080+CostBuy), IF(J1080 = \"Yes\", 0, K1079))","v":0},null,{"$f":"IF(I1080 = \"Yes\", M1079-(C1080+CostBuy)*K1080, IF(J1080=\"Yes\", M1079+(C1080-CostSell)*K1079, M1079+K1080*Rate))","v":7330070.4559392612}]
[null,1959.12,59.06,57.98,57.867500000000007,null,"No",null,{"$f":"IF(BuyAllowed=\"Yes\",IF(AND(G1081 = \"No\", C1081>D1081), \"Yes\", \"No\"),\"No\")","v":"Yes"},{"$f":"IF(SellAllowed=\"Yes\",IF(AND(G1081 = \"Yes\", C1081<E1081), \"Yes\", \"No\"),\"No\")","v":"No"},{"$f":"IF(I1081 = \"Yes\", M1080/(C1081+CostBuy), IF(J1081 = \"Yes\", 0, K1080))","v":124049.25462750484},null,{"$f":"IF(I1081 = \"Yes\", M1080-(C1081+CostBuy)*K1081, IF(J1081=\"Yes\", M1080+(C1081-CostSell)*K1080, M1080+K1081*Rate))","v":0}]
[null,1960.01,58.03,58.24666666666667,58.112500000000004,null,"Yes",null,{"$f":"IF(BuyAllowed=\"Yes\",IF(AND(G1082 = \"No\", C1082>D1082), \"Yes\", \"No\"),\"No\")","v":"No"},{"$f":"IF(SellAllowed=\"Yes\",IF(AND(G1082 = \"Yes\", C1082<E1082), \"Yes\", \"No\"),\"No\")","v":"Yes"},{"$f":"IF(I1082 = \"Yes\", M1081/(C1082+CostBuy), IF(J1082 = \"Yes\", 0, K1081))","v":0},null,{"$f":"IF(I1082 = \"Yes\", M1081-(C1082+CostBuy)*K1082, IF(J1082=\"Yes\", M1081+(C1082-CostSell)*K1081, M1081+K1082*Rate))","v":7191135.2907564556}]
[null,1960.02,55.78,57.961666666666666,58.121250000000003,null,"No",null,{"$f":"IF(BuyAllowed=\"Yes\",IF(AND(G1083 = \"No\", C1083>D1083), \"Yes\", \"No\"),\"No\")","v":"No"},{"$f":"IF(SellAllowed=\"Yes\",IF(AND(G1083 = \"Yes\", C1083<E1083), \"Yes\", \"No\"),\"No\")","v":"No"},{"$f":"IF(I1083 = \"Yes\", M1082/(C1083+CostBuy), IF(J1083 = \"Yes\", 0, K1082))","v":0},null,{"$f":"IF(I1083 = \"Yes\", M1082-(C1083+CostBuy)*K1083, IF(J1083=\"Yes\", M1082+(C1083-CostSell)*K1082, M1082+K1083*Rate))","v":7191135.2907564556}]
[null,1960.03,55.02,57.358333333333327,57.911249999999995,null,"No",null,{"$f":"IF(BuyAllowed=\"Yes\",IF(AND(G1084 = \"No\", C1084>D1084), \"Yes\", \"No\"),\"No\")","v":"No"},{"$f":"IF(SellAllowed=\"Yes\",IF(AND(G1084 = \"Yes\", C1084<E1084), \"Yes\", \"No\"),\"No\")","v":"No"},{"$f":"IF(I1084 = \"Yes\", M1083/(C1084+CostBuy), IF(J1084 = \"Yes\", 0, K1083))","v":0},null,{"$f":"IF(I1084 = \"Yes\", M1083-(C1084+CostBuy)*K1084, IF(J1084=\"Yes\", M1083+(C1084-CostSell)*K1083, M1083+K1084*Rate))","v":7191135.2907564556}]
[null,1960.04,55.73,57.02,57.321249999999992,null,"No",null,{"$f":"IF(BuyAllowed=\"Yes\",IF(AND(G1085 = \"No\", C1085>D1085), \"Yes\", \"No\"),\"No\")","v":"No"},{"$f":"IF(SellAllowed=\"Yes\",IF(AND(G1085 = \"Yes\", C1085<E1085), \"Yes\", \"No\"),\"No\")","v":"No"},{"$f":"IF(I1085 = \"Yes\", M1084/(C1085+CostBuy), IF(J1085 = \"Yes\", 0, K1084))","v":0},null,{"$f":"IF(I1085 = \"Yes\", M1084-(C1085+CostBuy)*K1085, IF(J1085=\"Yes\", M1084+(C1085-CostSell)*K1084, M1084+K1085*Rate))","v":7191135.2907564556}]
[null,1960.05,55.22,56.808333333333337,56.862499999999997,null,"No",null,{"$f":"IF(BuyAllowed=\"Yes\",IF(AND(G1086 = \"No\", C1086>D1086), \"Yes\", \"No\"),\"No\")","v":"No"},{"$f":"IF(SellAllowed=\"Yes\",IF(AND(G1086 = \"Yes\", C1086<E1086), \"Yes\", \"No\"),\"No\")","v":"No"},{"$f":"IF(I1086 = \"Yes\", M1085/(C1086+CostBuy), IF(J1086 = \"Yes\", 0, K1085))","v":0},null,{"$f":"IF(I1086 = \"Yes\", M1085-(C1086+CostBuy)*K1086, IF(J1086=\"Yes\", M1085+(C1086-CostSell)*K1085, M1085+K1086*Rate))","v":7191135.2907564556}]
[null,1960.06,57.26,56.473333333333336,56.633750000000006,null,"No",null,{"$f":"IF(BuyAllowed=\"Yes\",IF(AND(G1087 = \"No\", C1087>D1087), \"Yes\", \"No\"),\"No\")","v":"Yes"},{"$f":"IF(SellAllowed=\"Yes\",IF(AND(G1087 = \"Yes\", C1087<E1087), \"Yes\", \"No\"),\"No\")","v":"No"},{"$f":"IF(I1087 = \"Yes\", M1086/(C1087+CostBuy), IF(J1087 = \"Yes\", 0, K1086))","v":125521.64934118443},null,{"$f":"IF(I1087 = \"Yes\", M1086-(C1087+CostBuy)*K1087, IF(J1087=\"Yes\", M1086+(C1087-CostSell)*K1086, M1086+K1087*Rate))","v":0}]
[null,1960.07,55.84,56.173333333333325,56.666250000000005,null,"Yes",null,{"$f":"IF(BuyAllowed=\"Yes\",IF(AND(G1088 = \"No\", C1088>D1088), \"Yes\", \"No\"),\"No\")","v":"No"},{"$f":"IF(SellAllowed=\"Yes\",IF(AND(G1088 = \"Yes\", C1088<E1088), \"Yes\", \"No\"),\"No\")","v":"Yes"},{"$f":"IF(I1088 = \"Yes\", M1087/(C1088+CostBuy), IF(J1088 = \"Yes\", 0, K1087))","v":0},null,{"$f":"IF(I1088 = \"Yes\", M1087-(C1088+CostBuy)*K1088, IF(J1088=\"Yes\", M1087+(C1088-CostSell)*K1087, M1087+K1088*Rate))","v":7001597.6002512677}]
[null,1960.08,56.51,55.808333333333337,56.492500000000007,null,"No",null,{"$f":"IF(BuyAllowed=\"Yes\",IF(AND(G1089 = \"No\", C1089>D1089), \"Yes\", \"No\"),\"No\")","v":"Yes"},{"$f":"IF(SellAllowed=\"Yes\",IF(AND(G1089 = \"Yes\", C1089<E1089), \"Yes\", \"No\"),\"No\")","v":"No"},{"$f":"IF(I1089 = \"Yes\", M1088/(C1089+CostBuy), IF(J1089 = \"Yes\", 0, K1088))","v":123834.41104087845},null,{"$f":"IF(I1089 = \"Yes\", M1088-(C1089+CostBuy)*K1089, IF(J1089=\"Yes\", M1088+(C1089-CostSell)*K1088, M1088+K1089*Rate))","v":0}]
[null,1960.09,54.81,55.93,56.173749999999998,null,"Yes",null,{"$f":"IF(BuyAllowed=\"Yes\",IF(AND(G1090 = \"No\", C1090>D1090), \"Yes\", \"No\"),\"No\")","v":"No"},{"$f":"IF(SellAllowed=\"Yes\",IF(AND(G1090 = \"Yes\", C1090<E1090), \"Yes\", \"No\"),\"No\")","v":"Yes"},{"$f":"IF(I1090 = \"Yes\", M1089/(C1090+CostBuy), IF(J1090 = \"Yes\", 0, K1089))","v":0},null,{"$f":"IF(I1090 = \"Yes\", M1089-(C1090+CostBuy)*K1090, IF(J1090=\"Yes\", M1089+(C1090-CostSell)*K1089, M1089+K1090*Rate))","v":6779934.0044880947}]
[null,1960.1,53.73,55.895000000000003,55.771250000000002,null,"No",null,{"$f":"IF(BuyAllowed=\"Yes\",IF(AND(G1091 = \"No\", C1091>D1091), \"Yes\", \"No\"),\"No\")","v":"No"},{"$f":"IF(SellAllowed=\"Yes\",IF(AND(G1091 = \"Yes\", C1091<E1091), \"Yes\", \"No\"),\"No\")","v":"No"},{"$f":"IF(I1091 = \"Yes\", M1090/(C1091+CostBuy), IF(J1091 = \"Yes\", 0, K1090))","v":0},null,{"$f":"IF(I1091 = \"Yes\", M1090-(C1091+CostBuy)*K1091, IF(J1091=\"Yes\", M1090+(C1091-CostSell)*K1090, M1090+K1091*Rate))","v":6779934.0044880947}]
[null,1960.11,55.47,55.561666666666667,55.515000000000001,null,"No",null,{"$f":"IF(BuyAllowed=\"Yes\",IF(AND(G1092 = \"No\", C1092>D1092), \"Yes\", \"No\"),\"No\")","v":"No"},{"$f":"IF(SellAllowed=\"Yes\",IF(AND(G1092 = \"Yes\", C1092<E1092), \"Yes\", \"No\"),\"No\")","v":"No"},{"$f":"IF(I1092 = \"Yes\", M1091/(C1092+CostBuy), IF(J1092 = \"Yes\", 0, K1091))","v":0},null,{"$f":"IF(I1092 = \"Yes\", M1091-(C1092+CostBuy)*K1092, IF(J1092=\"Yes\", M1091+(C1092-CostSell)*K1091, M1091+K1092*Rate))","v":6779934.0044880947}]
[null,1960.12,56.8,55.603333333333332,55.571250000000006,null,"No",null,{"$f":"IF(BuyAllowed=\"Yes\",IF(AND(G1093 = \"No\", C1093>D1093), \"Yes\", \"No\"),\"No\")","v":"Yes"},{"$f":"IF(SellAllowed=\"Yes\",IF(AND(G1093 = \"Yes\", C1093<E1093), \"Yes\", \"No\"),\"No\")","v":"No"},{"$f":"IF(I1093 = \"Yes\", M1092/(C1093+CostBuy), IF(J1093 = \"Yes\", 0, K1092))","v":119302.02365806959},null,{"$f":"IF(I1093 = \"Yes\", M1092-(C1093+CostBuy)*K1093, IF(J1093=\"Yes\", M1092+(C1093-CostSell)*K1092, M1092+K1093*Rate))","v":0}]
[null,1961.01,59.72,55.526666666666671,55.705000000000005,null,"Yes",null,{"$f":"IF(BuyAllowed=\"Yes\",IF(AND(G1094 = \"No\", C1094>D1094), \"Yes\", \"No\"),\"No\")","v":"No"},{"$f":"IF(SellAllowed=\"Yes\",IF(AND(G1094 = \"Yes\", C1094<E1094), \"Yes\", \"No\"),\"No\")","v":"No"},{"$f":"IF(I1094 = \"Yes\", M1093/(C1094+CostBuy), IF(J1094 = \"Yes\", 0, K1093))","v":119302.02365806959},null,{"$f":"IF(I1094 = \"Yes\", M1093-(C1094+CostBuy)*K1094, IF(J1094=\"Yes\", M1093+(C1094-CostSell)*K1093, M1093+K1094*Rate))","v":5965.1011829034796}]
[null,1961.02,62.17,56.173333333333325,56.267499999999998,null,"Yes",null,{"$f":"IF(BuyAllowed=\"Yes\",IF(AND(G1095 = \"No\", C1095>D1095), \"Yes\", \"No\"),\"No\")","v":"No"},{"$f":"IF(SellAllowed=\"Yes\",IF(AND(G1095 = \"Yes\", C1095<E1095), \"Yes\", \"No\"),\"No\")","v":"No"},{"$f":"IF(I1095 = \"Yes\", M1094/(C1095+CostBuy), IF(J1095 = \"Yes\", 0, K1094))","v":119302.02365806959},null,{"$f":"IF(I1095 = \"Yes\", M1094-(C1095+CostBuy)*K1095, IF(J1095=\"Yes\", M1094+(C1095-CostSell)*K1094, M1094+K1095*Rate))","v":11930.202365806959}]
[null,1961.03,64.12,57.116666666666667,56.881250000000001,null,"Yes",null,{"$f":"IF(BuyAllowed=\"Yes\",IF(AND(G1096 = \"No\", C1096>D1096), \"Yes\", \"No\"),\"No\")","v":"No"},{"$f":"IF(SellAllowed=\"Yes\",IF(AND(G1096 = \"Yes\", C1096<E1096), \"Yes\", \"No\"),\"No\")","v":"No"},{"$f":"IF(I1096 = \"Yes\", M1095/(C1096+CostBuy), IF(J1096 = \"Yes\", 0, K1095))","v":119302.02365806959},null,{"$f":"IF(I1096 = \"Yes\", M1095-(C1096+CostBuy)*K1096, IF(J1096=\"Yes\", M1095+(C1096-CostSell)*K1095, M1095+K1096*Rate))","v":17895.303548710439}]
[null,1961.04,65.83,58.668333333333329,57.916249999999998,null,"Yes",null,{"$f":"IF(BuyAllowed=\"Yes\",IF(AND(G1097 = \"No\", C1097>D1097), \"Yes\", \"No\"),\"No\")","v":"No"},{"$f":"IF(SellAllowed=\"Yes\",IF(AND(G1097 = \"Yes\", C1097<E1097), \"Yes\", \"No\"),\"No\")","v":"No"},{"$f":"IF(I1097 = \"Yes\", M1096/(C1097+CostBuy), IF(J1097 = \"Yes\", 0, K1096))","v":119302.02365806959},null,{"$f":"IF(I1097 = \"Yes\", M1096-(C1097+CostBuy)*K1097, IF(J1097=\"Yes\", M1096+(C1097-CostSell)*K1096, M1096+K1097*Rate))","v":23860.404731613919}]
[null,1961.05,66.5,60.685000000000002,59.081249999999997,null,"Yes",null,{"$f":"IF(BuyAllowed=\"Yes\",IF(AND(G1098 = \"No\", C1098>D1098), \"Yes\", \"No\"),\"No\")","v":"No"},{"$f":"IF(SellAllowed=\"Yes\",IF(AND(G1098 = \"Yes\", C1098<E1098), \"Yes\", \"No\"),\"No\")","v":"No"},{"$f":"IF(I1098 = \"Yes\", M1097/(C1098+CostBuy), IF(J1098 = \"Yes\", 0, K1097))","v":119302.02365806959},null,{"$f":"IF(I1098 = \"Yes\", M1097-(C1098+CostBuy)*K1098, IF(J1098=\"Yes\", M1097+(C1098-CostSell)*K1097, M1097+K1098*Rate))","v":29825.505914517398}]
[null,1961.06,65.62,62.523333333333333,60.542499999999997,null,"Yes",null,{"$f":"IF(BuyAllowed=\"Yes\",IF(AND(G1099 = \"No\", C1099>D1099), \"Yes\", \"No\"),\"No\")","v":"No"},{"$f":"IF(SellAllowed=\"Yes\",IF(AND(G1099 = \"Yes\", C1099<E1099), \"Yes\", \"No\"),\"No\")","v":"No"},{"$f":"IF(I1099 = \"Yes\", M1098/(C1099+CostBuy), IF(J1099 = \"Yes\", 0, K1098))","v":119302.02365806959},null,{"$f":"IF(I1099 = \"Yes\", M1098-(C1099+CostBuy)*K1099, IF(J1099=\"Yes\", M1098+(C1099-CostSell)*K1098, M1098+K1099*Rate))","v":35790.607097420878}]
[null,1961.07,65.44,63.993333333333332,62.028750000000002,null,"Yes",null,{"$f":"IF(BuyAllowed=\"Yes\",IF(AND(G1100 = \"No\", C1100>D1100), \"Yes\", \"No\"),\"No\")","v":"No"},{"$f":"IF(SellAllowed=\"Yes\",IF(AND(G1100 = \"Yes\", C1100<E1100), \"Yes\", \"No\"),\"No\")","v":"No"},{"$f":"IF(I1100 = \"Yes\", M1099/(C1100+CostBuy), IF(J1100 = \"Yes\", 0, K1099))","v":119302.02365806959},null,{"$f":"IF(I1100 = \"Yes\", M1099-(C1100+CostBuy)*K1100, IF(J1100=\"Yes\", M1099+(C1100-CostSell)*K1099, M1099+K1100*Rate))","v":41755.708280324354}]
[null,1961.08,67.790000000000006,64.946666666666673,63.274999999999999,null,"Yes",null,{"$f":"IF(BuyAllowed=\"Yes\",IF(AND(G1101 = \"No\", C1101>D1101), \"Yes\", \"No\"),\"No\")","v":"No"},{"$f":"IF(SellAllowed=\"Yes\",IF(AND(G1101 = \"Yes\", C1101<E1101), \"Yes\", \"No\"),\"No\")","v":"No"},{"$f":"IF(I1101 = \"Yes\", M1100/(C1101+CostBuy), IF(J1101 = \"Yes\", 0, K1100))","v":119302.02365806959},null,{"$f":"IF(I1101 = \"Yes\", M1100-(C1101+CostBuy)*K1101, IF(J1101=\"Yes\", M1100+(C1101-CostSell)*K1100, M1100+K1101*Rate))","v":47720.809463227837}]
[null,1961.09,67.260000000000005,65.88333333333334,64.648749999999993,null,"Yes",null,{"$f":"IF(BuyAllowed=\"Yes\",IF(AND(G1102 = \"No\", C1102>D1102), \"Yes\", \"No\"),\"No\")","v":"No"},{"$f":"IF(SellAllowed=\"Yes\",IF(AND(G1102 = \"Yes\", C1102<E1102), \"Yes\", \"No\"),\"No\")","v":"No"},{"$f":"IF(I1102 = \"Yes\", M1101/(C1102+CostBuy), IF(J1102 = \"Yes\", 0, K1101))","v":119302.02365806959},null,{"$f":"IF(I1102 = \"Yes\", M1101-(C1102+CostBuy)*K1102, IF(J1102=\"Yes\", M1101+(C1102-CostSell)*K1101, M1101+K1102*Rate))","v":53685.91064613132}]
[null,1961.1,68,66.406666666666666,65.591250000000002,null,"Yes",null,{"$f":"IF(BuyAllowed=\"Yes\",IF(AND(G1103 = \"No\", C1103>D1103), \"Yes\", \"No\"),\"No\")","v":"No"},{"$f":"IF(SellAllowed=\"Yes\",IF(AND(G1103 = \"Yes\", C1103<E1103), \"Yes\", \"No\"),\"No\")","v":"No"},{"$f":"IF(I1103 = \"Yes\", M1102/(C1103+CostBuy), IF(J1103 = \"Yes\", 0, K1102))","v":119302.02365806959},null,{"$f":"IF(I1103 = \"Yes\", M1102-(C1103+CostBuy)*K1103, IF(J1103=\"Yes\", M1102+(C1103-CostSell)*K1102, M1102+K1103*Rate))","v":59651.011829034804}]
[null,1961.11,71.08,66.768333333333331,66.319999999999993,null,"Yes",null,{"$f":"IF(BuyAllowed=\"Yes\",IF(AND(G1104 = \"No\", C1104>D1104), \"Yes\", \"No\"),\"No\")","v":"No"},{"$f":"IF(SellAllowed=\"Yes\",IF(AND(G1104 = \"Yes\", C1104<E1104), \"Yes\", \"No\"),\"No\")","v":"No"},{"$f":"IF(I1104 = \"Yes\", M1103/(C1104+CostBuy), IF(J1104 = \"Yes\", 0, K1103))","v":119302.02365806959},null,{"$f":"IF(I1104 = \"Yes\", M1103-(C1104+CostBuy)*K1104, IF(J1104=\"Yes\", M1103+(C1104-CostSell)*K1103, M1103+K1104*Rate))","v":65616.113011938287}]
[null,1961.12,71.739999999999995,67.531666666666666,67.19,null,"Yes",null,{"$f":"IF(BuyAllowed=\"Yes\",IF(AND(G1105 = \"No\", C1105>D1105), \"Yes\", \"No\"),\"No\")","v":"No"},{"$f":"IF(SellAllowed=\"Yes\",IF(AND(G1105 = \"Yes\", C1105<E1105), \"Yes\", \"No\"),\"No\")","v":"No"},{"$f":"IF(I1105 = \"Yes\", M1104/(C1105+CostBuy), IF(J1105 = \"Yes\", 0, K1104))","v":119302.02365806959},null,{"$f":"IF(I1105 = \"Yes\", M1104-(C1105+CostBuy)*K1105, IF(J1105=\"Yes\", M1104+(C1105-CostSell)*K1104, M1104+K1105*Rate))","v":71581.21419484177}]
[null,1962.01,69.069999999999993,68.551666666666662,67.928749999999994,null,"Yes",null,{"$f":"IF(BuyAllowed=\"Yes\",IF(AND(G1106 = \"No\", C1106>D1106), \"Yes\", \"No\"),\"No\")","v":"No"},{"$f":"IF(SellAllowed=\"Yes\",IF(AND(G1106 = \"Yes\", C1106<E1106), \"Yes\", \"No\"),\"No\")","v":"No"},{"$f":"IF(I1106 = \"Yes\", M1105/(C1106+CostBuy), IF(J1106 = \"Yes\", 0, K1105))","v":119302.02365806959},null,{"$f":"IF(I1106 = \"Yes\", M1105-(C1106+CostBuy)*K1106, IF(J1106=\"Yes\", M1105+(C1106-CostSell)*K1105, M1105+K1106*Rate))","v":77546.315377745253}]
[null,1962.02,70.22,69.156666666666666,68.25,null,"Yes",null,{"$f":"IF(BuyAllowed=\"Yes\",IF(AND(G1107 = \"No\", C1107>D1107), \"Yes\", \"No\"),\"No\")","v":"No"},{"$f":"IF(SellAllowed=\"Yes\",IF(AND(G1107 = \"Yes\", C1107<E1107), \"Yes\", \"No\"),\"No\")","v":"No"},{"$f":"IF(I1107 = \"Yes\", M1106/(C1107+CostBuy), IF(J1107 = \"Yes\", 0, K1106))","v":119302.02365806959},null,{"$f":"IF(I1107 = \"Yes\", M1106-(C1107+CostBuy)*K1107, IF(J1107=\"Yes\", M1106+(C1107-CostSell)*K1106, M1106+K1107*Rate))","v":83511.416560648737}]
[null,1962.03,70.290000000000006,69.561666666666667,68.825000000000003,null,"Yes",null,{"$f":"IF(BuyAllowed=\"Yes\",IF(AND(G1108 = \"No\", C1108>D1108), \"Yes\", \"No\"),\"No\")","v":"No"},{"$f":"IF(SellAllowed=\"Yes\",IF(AND(G1108 = \"Yes\", C1108<E1108), \"Yes\", \"No\"),\"No\")","v":"No"},{"$f":"IF(I1108 = \"Yes\", M1107/(C1108+CostBuy), IF(J1108 = \"Yes\", 0, K1107))","v":119302.02365806959},null,{"$f":"IF(I1108 = \"Yes\", M1107-(C1108+CostBuy)*K1108, IF(J1108=\"Yes\", M1107+(C1108-CostSell)*K1107, M1107+K1108*Rate))","v":89476.51774355222}]
[null,1962.04,68.05,70.066666666666677,69.431249999999991,null,"Yes",null,{"$f":"IF(BuyAllowed=\"Yes\",IF(AND(G1109 = \"No\", C1109>D1109), \"Yes\", \"No\"),\"No\")","v":"No"},{"$f":"IF(SellAllowed=\"Yes\",IF(AND(G1109 = \"Yes\", C1109<E1109), \"Yes\", \"No\"),\"No\")","v":"Yes"},{"$f":"IF(I1109 = \"Yes\", M1108/(C1109+CostBuy), IF(J1109 = \"Yes\", 0, K1108))","v":0},null,{"$f":"IF(I1109 = \"Yes\", M1108-(C1109+CostBuy)*K1109, IF(J1109=\"Yes\", M1108+(C1109-CostSell)*K1108, M1108+K1109*Rate))","v":8200821.1062557027}]
[null,1962.05,62.99,70.075000000000003,69.463750000000005,null,"No",null,{"$f":"IF(BuyAllowed=\"Yes\",IF(AND(G1110 = \"No\", C1110>D1110), \"Yes\", \"No\"),\"No\")","v":"No"},{"$f":"IF(SellAllowed=\"Yes\",IF(AND(G1110 = \"Yes\", C1110<E1110), \"Yes\", \"No\"),\"No\")","v":"No"},{"$f":"IF(I1110 = \"Yes\", M1109/(C1110+CostBuy), IF(J1110 = \"Yes\", 0, K1109))","v":0},null,{"$f":"IF(I1110 = \"Yes\", M1109-(C1110+CostBuy)*K1110, IF(J1110=\"Yes\", M1109+(C1110-CostSell)*K1109, M1109+K1110*Rate))","v":8200821.1062557027}]
[null,1962.06,55.63,68.726666666666674,68.930000000000007,null,"No",null,{"$f":"IF(BuyAllowed=\"Yes\",IF(AND(G1111 = \"No\", C1111>D1111), \"Yes\", \"No\"),\"No\")","v":"No"},{"$f":"IF(SellAllowed=\"Yes\",IF(AND(G1111 = \"Yes\", C1111<E1111), \"Yes\", \"No\"),\"No\")","v":"No"},{"$f":"IF(I1111 = \"Yes\", M1110/(C1111+CostBuy), IF(J1111 = \"Yes\", 0, K1110))","v":0},null,{"$f":"IF(I1111 = \"Yes\", M1110-(C1111+CostBuy)*K1111, IF(J1111=\"Yes\", M1110+(C1111-CostSell)*K1110, M1110+K1111*Rate))","v":8200821.1062557027}]
[null,1962.07,56.97,66.041666666666671,67.383750000000006,null,"No",null,{"$f":"IF(BuyAllowed=\"Yes\",IF(AND(G1112 = \"No\", C1112>D1112), \"Yes\", \"No\"),\"No\")","v":"No"},{"$f":"IF(SellAllowed=\"Yes\",IF(AND(G1112 = \"Yes\", C1112<E1112), \"Yes\", \"No\"),\"No\")","v":"No"},{"$f":"IF(I1112 = \"Yes\", M1111/(C1112+CostBuy), IF(J1112 = \"Yes\", 0, K1111))","v":0},null,{"$f":"IF(I1112 = \"Yes\", M1111-(C1112+CostBuy)*K1112, IF(J1112=\"Yes\", M1111+(C1112-CostSell)*K1111, M1111+K1112*Rate))","v":8200821.1062557027}]
[null,1962.08,58.52,64.024999999999991,65.62,null,"No",null,{"$f":"IF(BuyAllowed=\"Yes\",IF(AND(G1113 = \"No\", C1113>D1113), \"Yes\", \"No\"),\"No\")","v":"No"},{"$f":"IF(SellAllowed=\"Yes\",IF(AND(G1113 = \"Yes\", C1113<E1113), \"Yes\", \"No\"),\"No\")","v":"No"},{"$f":"IF(I1113 = \"Yes\", M1112/(C1113+CostBuy), IF(J1113 = \"Yes\", 0, K1112))","v":0},null,{"$f":"IF(I1113 = \"Yes\", M1112-(C1113+CostBuy)*K1113, IF(J1113=\"Yes\", M1112+(C1113-CostSell)*K1112, M1112+K1113*Rate))","v":8200821.1062557027}]
[null,1962.09,58,62.07500000000001,63.967500000000001,null,"No",null,{"$f":"IF(BuyAllowed=\"Yes\",IF(AND(G1114 = \"No\", C1114>D1114), \"Yes\", \"No\"),\"No\")","v":"No"},{"$f":"IF(SellAllowed=\"Yes\",IF(AND(G1114 = \"Yes\", C1114<E1114), \"Yes\", \"No\"),\"No\")","v":"No"},{"$f":"IF(I1114 = \"Yes\", M1113/(C1114+CostBuy), IF(J1114 = \"Yes\", 0, K1113))","v":0},null,{"$f":"IF(I1114 = \"Yes\", M1113-(C1114+CostBuy)*K1114, IF(J1114=\"Yes\", M1113+(C1114-CostSell)*K1113, M1113+K1114*Rate))","v":8200821.1062557027}]
[null,1962.1,56.17,{"$f":"AVERAGE(C1109:C1114)","v":60.026666666666664},{"$f":"AVERAGE(C1107:C1114)","v":62.583749999999995},null,"No",null,{"$f":"IF(BuyAllowed=\"Yes\",IF(AND(G1115 = \"No\", C1115>D1115), \"Yes\", \"No\"),\"No\")","v":"No"},{"$f":"IF(SellAllowed=\"Yes\",IF(AND(G1115 = \"Yes\", C1115<E1115), \"Yes\", \"No\"),\"No\")","v":"No"},{"$f":"IF(I1115 = \"Yes\", M1114/(C1115+CostBuy), IF(J1115 = \"Yes\", 0, K1114))","v":0},null,{"$f":"IF(I1115 = \"Yes\", M1114-(C1115+CostBuy)*K1115, IF(J1115=\"Yes\", M1114+(C1115-CostSell)*K1114, M1114+K1115*Rate))","v":8200821.1062557027}]
[null,1962.11,60.04,58.046666666666674,60.827500000000008,null,{"$f":"IF(I1115 = \"Yes\", \"Yes\", IF(J1115=\"Yes\", \"No\", G1115))","v":"No"},null,{"$f":"IF(BuyAllowed=\"Yes\",IF(AND(G1116 = \"No\", C1116>D1116), \"Yes\", \"No\"),\"No\")","v":"Yes"},{"$f":"IF(SellAllowed=\"Yes\",IF(AND(G1116 = \"Yes\", C1116<E1116), \"Yes\", \"No\"),\"No\")","v":"No"},{"$f":"IF(I1116 = \"Yes\", M1115/(C1116+CostBuy), IF(J1116 = \"Yes\", 0, K1115))","v":136521.07718088402},null,{"$f":"IF(I1116 = \"Yes\", M1115-(C1116+CostBuy)*K1116, IF(J1116=\"Yes\", M1115+(C1116-CostSell)*K1115, M1115+K1116*Rate))","v":-9.3132257461547852E-10}]
[null,1962.12,62.64,57.555000000000007,59.546250000000001,null,"Yes",null,{"$f":"IF(BuyAllowed=\"Yes\",IF(AND(G1117 = \"No\", C1117>D1117), \"Yes\", \"No\"),\"No\")","v":"No"},{"$f":"IF(SellAllowed=\"Yes\",IF(AND(G1117 = \"Yes\", C1117<E1117), \"Yes\", \"No\"),\"No\")","v":"No"},{"$f":"IF(I1117 = \"Yes\", M1116/(C1117+CostBuy), IF(J1117 = \"Yes\", 0, K1116))","v":136521.07718088402},null,{"$f":"IF(I1117 = \"Yes\", M1116-(C1117+CostBuy)*K1117, IF(J1117=\"Yes\", M1116+(C1117-CostSell)*K1116, M1116+K1117*Rate))","v":6826.0538590432698}]
[null,1963.01,65.06,58.723333333333336,58.870000000000005,null,"Yes",null,{"$f":"IF(BuyAllowed=\"Yes\",IF(AND(G1118 = \"No\", C1118>D1118), \"Yes\", \"No\"),\"No\")","v":"No"},{"$f":"IF(SellAllowed=\"Yes\",IF(AND(G1118 = \"Yes\", C1118<E1118), \"Yes\", \"No\"),\"No\")","v":"No"},{"$f":"IF(I1118 = \"Yes\", M1117/(C1118+CostBuy), IF(J1118 = \"Yes\", 0, K1117))","v":136521.07718088402},null,{"$f":"IF(I1118 = \"Yes\", M1117-(C1118+CostBuy)*K1118, IF(J1118=\"Yes\", M1117+(C1118-CostSell)*K1117, M1117+K1118*Rate))","v":13652.107718087471}]
[null,1963.02,65.92,60.071666666666665,59.128750000000004,null,"Yes",null,{"$f":"IF(BuyAllowed=\"Yes\",IF(AND(G1119 = \"No\", C1119>D1119), \"Yes\", \"No\"),\"No\")","v":"No"},{"$f":"IF(SellAllowed=\"Yes\",IF(AND(G1119 = \"Yes\", C1119<E1119), \"Yes\", \"No\"),\"No\")","v":"No"},{"$f":"IF(I1119 = \"Yes\", M1118/(C1119+CostBuy), IF(J1119 = \"Yes\", 0, K1118))","v":136521.07718088402},null,{"$f":"IF(I1119 = \"Yes\", M1118-(C1119+CostBuy)*K1119, IF(J1119=\"Yes\", M1118+(C1119-CostSell)*K1118, M1118+K1119*Rate))","v":20478.161577131672}]
[null,1963.03,65.67,61.305000000000007,60.415000000000006,null,"Yes",null,{"$f":"IF(BuyAllowed=\"Yes\",IF(AND(G1120 = \"No\", C1120>D1120), \"Yes\", \"No\"),\"No\")","v":"No"},{"$f":"IF(SellAllowed=\"Yes\",IF(AND(G1120 = \"Yes\", C1120<E1120), \"Yes\", \"No\"),\"No\")","v":"No"},{"$f":"IF(I1120 = \"Yes\", M1119/(C1120+CostBuy), IF(J1120 = \"Yes\", 0, K1119))","v":136521.07718088402},null,{"$f":"IF(I1120 = \"Yes\", M1119-(C1120+CostBuy)*K1120, IF(J1120=\"Yes\", M1119+(C1120-CostSell)*K1119, M1119+K1120*Rate))","v":27304.215436175873}]
[null,1963.04,68.760000000000005,62.583333333333343,61.502500000000005,null,"Yes",null,{"$f":"IF(BuyAllowed=\"Yes\",IF(AND(G1121 = \"No\", C1121>D1121), \"Yes\", \"No\"),\"No\")","v":"No"},{"$f":"IF(SellAllowed=\"Yes\",IF(AND(G1121 = \"Yes\", C1121<E1121), \"Yes\", \"No\"),\"No\")","v":"No"},{"$f":"IF(I1121 = \"Yes\", M1120/(C1121+CostBuy), IF(J1121 = \"Yes\", 0, K1120))","v":136521.07718088402},null,{"$f":"IF(I1121 = \"Yes\", M1120-(C1121+CostBuy)*K1121, IF(J1121=\"Yes\", M1120+(C1121-CostSell)*K1120, M1120+K1121*Rate))","v":34130.269295220074}]
[null,1963.05,70.14,64.681666666666672,62.782500000000006,null,"Yes",null,{"$f":"IF(BuyAllowed=\"Yes\",IF(AND(G1122 = \"No\", C1122>D1122), \"Yes\", \"No\"),\"No\")","v":"No"},{"$f":"IF(SellAllowed=\"Yes\",IF(AND(G1122 = \"Yes\", C1122<E1122), \"Yes\", \"No\"),\"No\")","v":"No"},{"$f":"IF(I1122 = \"Yes\", M1121/(C1122+CostBuy), IF(J1122 = \"Yes\", 0, K1121))","v":136521.07718088402},null,{"$f":"IF(I1122 = \"Yes\", M1121-(C1122+CostBuy)*K1122, IF(J1122=\"Yes\", M1121+(C1122-CostSell)*K1121, M1121+K1122*Rate))","v":40956.323154264275}]
[null,1963.06,70.11,66.364999999999995,64.300000000000011,null,"Yes",null,{"$f":"IF(BuyAllowed=\"Yes\",IF(AND(G1123 = \"No\", C1123>D1123), \"Yes\", \"No\"),\"No\")","v":"No"},{"$f":"IF(SellAllowed=\"Yes\",IF(AND(G1123 = \"Yes\", C1123<E1123), \"Yes\", \"No\"),\"No\")","v":"No"},{"$f":"IF(I1123 = \"Yes\", M1122/(C1123+CostBuy), IF(J1123 = \"Yes\", 0, K1122))","v":136521.07718088402},null,{"$f":"IF(I1123 = \"Yes\", M1122-(C1123+CostBuy)*K1123, IF(J1123=\"Yes\", M1122+(C1123-CostSell)*K1122, M1122+K1123*Rate))","v":47782.377013308476}]
[null,1963.07,69.069999999999993,67.61,66.042500000000004,null,"Yes",null,{"$f":"IF(BuyAllowed=\"Yes\",IF(AND(G1124 = \"No\", C1124>D1124), \"Yes\", \"No\"),\"No\")","v":"No"},{"$f":"IF(SellAllowed=\"Yes\",IF(AND(G1124 = \"Yes\", C1124<E1124), \"Yes\", \"No\"),\"No\")","v":"No"},{"$f":"IF(I1124 = \"Yes\", M1123/(C1124+CostBuy), IF(J1124 = \"Yes\", 0, K1123))","v":136521.07718088402},null,{"$f":"IF(I1124 = \"Yes\", M1123-(C1124+CostBuy)*K1124, IF(J1124=\"Yes\", M1123+(C1124-CostSell)*K1123, M1123+K1124*Rate))","v":54608.430872352677}]
[null,1963.08,70.98,68.278333333333336,67.171250000000001,null,"Yes",null,{"$f":"IF(BuyAllowed=\"Yes\",IF(AND(G1125 = \"No\", C1125>D1125), \"Yes\", \"No\"),\"No\")","v":"No"},{"$f":"IF(SellAllowed=\"Yes\",IF(AND(G1125 = \"Yes\", C1125<E1125), \"Yes\", \"No\"),\"No\")","v":"No"},{"$f":"IF(I1125 = \"Yes\", M1124/(C1125+CostBuy), IF(J1125 = \"Yes\", 0, K1124))","v":136521.07718088402},null,{"$f":"IF(I1125 = \"Yes\", M1124-(C1125+CostBuy)*K1125, IF(J1125=\"Yes\", M1124+(C1125-CostSell)*K1124, M1124+K1125*Rate))","v":61434.484731396878}]
[null,1963.09,72.849999999999994,69.12166666666667,68.213750000000005,null,"Yes",null,{"$f":"IF(BuyAllowed=\"Yes\",IF(AND(G1126 = \"No\", C1126>D1126), \"Yes\", \"No\"),\"No\")","v":"No"},{"$f":"IF(SellAllowed=\"Yes\",IF(AND(G1126 = \"Yes\", C1126<E1126), \"Yes\", \"No\"),\"No\")","v":"No"},{"$f":"IF(I1126 = \"Yes\", M1125/(C1126+CostBuy), IF(J1126 = \"Yes\", 0, K1125))","v":136521.07718088402},null,{"$f":"IF(I1126 = \"Yes\", M1125-(C1126+CostBuy)*K1126, IF(J1126=\"Yes\", M1125+(C1126-CostSell)*K1125, M1125+K1126*Rate))","v":68260.53859044108}]
[null,1963.1,73.03,70.318333333333328,69.1875,null,"Yes",null,{"$f":"IF(BuyAllowed=\"Yes\",IF(AND(G1127 = \"No\", C1127>D1127), \"Yes\", \"No\"),\"No\")","v":"No"},{"$f":"IF(SellAllowed=\"Yes\",IF(AND(G1127 = \"Yes\", C1127<E1127), \"Yes\", \"No\"),\"No\")","v":"No"},{"$f":"IF(I1127 = \"Yes\", M1126/(C1127+CostBuy), IF(J1127 = \"Yes\", 0, K1126))","v":136521.07718088402},null,{"$f":"IF(I1127 = \"Yes\", M1126-(C1127+CostBuy)*K1127, IF(J1127=\"Yes\", M1126+(C1127-CostSell)*K1126, M1126+K1127*Rate))","v":75086.592449485281}]
[null,1963.11,72.62,71.029999999999987,70.076250000000002,null,"Yes",null,{"$f":"IF(BuyAllowed=\"Yes\",IF(AND(G1128 = \"No\", C1128>D1128), \"Yes\", \"No\"),\"No\")","v":"No"},{"$f":"IF(SellAllowed=\"Yes\",IF(AND(G1128 = \"Yes\", C1128<E1128), \"Yes\", \"No\"),\"No\")","v":"No"},{"$f":"IF(I1128 = \"Yes\", M1127/(C1128+CostBuy), IF(J1128 = \"Yes\", 0, K1127))","v":136521.07718088402},null,{"$f":"IF(I1128 = \"Yes\", M1127-(C1128+CostBuy)*K1128, IF(J1128=\"Yes\", M1127+(C1128-CostSell)*K1127, M1127+K1128*Rate))","v":81912.646308529482}]
[null,1963.12,74.17,71.443333333333328,70.944999999999993,null,"Yes",null,{"$f":"IF(BuyAllowed=\"Yes\",IF(AND(G1129 = \"No\", C1129>D1129), \"Yes\", \"No\"),\"No\")","v":"No"},{"$f":"IF(SellAllowed=\"Yes\",IF(AND(G1129 = \"Yes\", C1129<E1129), \"Yes\", \"No\"),\"No\")","v":"No"},{"$f":"IF(I1129 = \"Yes\", M1128/(C1129+CostBuy), IF(J1129 = \"Yes\", 0, K1128))","v":136521.07718088402},null,{"$f":"IF(I1129 = \"Yes\", M1128-(C1129+CostBuy)*K1129, IF(J1129=\"Yes\", M1128+(C1129-CostSell)*K1128, M1128+K1129*Rate))","v":88738.700167573683}]
[null,1964.01,76.45,72.12,71.621249999999989,null,"Yes",null,{"$f":"IF(BuyAllowed=\"Yes\",IF(AND(G1130 = \"No\", C1130>D1130), \"Yes\", \"No\"),\"No\")","v":"No"},{"$f":"IF(SellAllowed=\"Yes\",IF(AND(G1130 = \"Yes\", C1130<E1130), \"Yes\", \"No\"),\"No\")","v":"No"},{"$f":"IF(I1130 = \"Yes\", M1129/(C1130+CostBuy), IF(J1130 = \"Yes\", 0, K1129))","v":136521.07718088402},null,{"$f":"IF(I1130 = \"Yes\", M1129-(C1130+CostBuy)*K1130, IF(J1130=\"Yes\", M1129+(C1130-CostSell)*K1129, M1129+K1130*Rate))","v":95564.754026617884}]
[null,1964.02,77.39,73.350000000000009,72.41,null,"Yes",null,{"$f":"IF(BuyAllowed=\"Yes\",IF(AND(G1131 = \"No\", C1131>D1131), \"Yes\", \"No\"),\"No\")","v":"No"},{"$f":"IF(SellAllowed=\"Yes\",IF(AND(G1131 = \"Yes\", C1131<E1131), \"Yes\", \"No\"),\"No\")","v":"No"},{"$f":"IF(I1131 = \"Yes\", M1130/(C1131+CostBuy), IF(J1131 = \"Yes\", 0, K1130))","v":136521.07718088402},null,{"$f":"IF(I1131 = \"Yes\", M1130-(C1131+CostBuy)*K1131, IF(J1131=\"Yes\", M1130+(C1131-CostSell)*K1130, M1130+K1131*Rate))","v":102390.80788566209}]
[null,1964.03,78.8,74.418333333333337,73.320000000000007,null,"Yes",null,{"$f":"IF(BuyAllowed=\"Yes\",IF(AND(G1132 = \"No\", C1132>D1132), \"Yes\", \"No\"),\"No\")","v":"No"},{"$f":"IF(SellAllowed=\"Yes\",IF(AND(G1132 = \"Yes\", C1132<E1132), \"Yes\", \"No\"),\"No\")","v":"No"},{"$f":"IF(I1132 = \"Yes\", M1131/(C1132+CostBuy), IF(J1132 = \"Yes\", 0, K1131))","v":136521.07718088402},null,{"$f":"IF(I1132 = \"Yes\", M1131-(C1132+CostBuy)*K1132, IF(J1132=\"Yes\", M1131+(C1132-CostSell)*K1131, M1131+K1132*Rate))","v":109216.86174470629}]
[null,1964.04,79.94,75.41,74.536249999999995,null,"Yes",null,{"$f":"IF(BuyAllowed=\"Yes\",IF(AND(G1133 = \"No\", C1133>D1133), \"Yes\", \"No\"),\"No\")","v":"No"},{"$f":"IF(SellAllowed=\"Yes\",IF(AND(G1133 = \"Yes\", C1133<E1133), \"Yes\", \"No\"),\"No\")","v":"No"},{"$f":"IF(I1133 = \"Yes\", M1132/(C1133+CostBuy), IF(J1133 = \"Yes\", 0, K1132))","v":136521.07718088402},null,{"$f":"IF(I1133 = \"Yes\", M1132-(C1133+CostBuy)*K1133, IF(J1133=\"Yes\", M1132+(C1133-CostSell)*K1132, M1132+K1133*Rate))","v":116042.91560375049}]
[null,1964.05,80.72,76.561666666666667,75.65625,null,"Yes",null,{"$f":"IF(BuyAllowed=\"Yes\",IF(AND(G1134 = \"No\", C1134>D1134), \"Yes\", \"No\"),\"No\")","v":"No"},{"$f":"IF(SellAllowed=\"Yes\",IF(AND(G1134 = \"Yes\", C1134<E1134), \"Yes\", \"No\"),\"No\")","v":"No"},{"$f":"IF(I1134 = \"Yes\", M1133/(C1134+CostBuy), IF(J1134 = \"Yes\", 0, K1133))","v":136521.07718088402},null,{"$f":"IF(I1134 = \"Yes\", M1133-(C1134+CostBuy)*K1134, IF(J1134=\"Yes\", M1133+(C1134-CostSell)*K1133, M1133+K1134*Rate))","v":122868.96946279469}]
[null,1964.06,80.239999999999995,77.911666666666676,76.64,null,"Yes",null,{"$f":"IF(BuyAllowed=\"Yes\",IF(AND(G1135 = \"No\", C1135>D1135), \"Yes\", \"No\"),\"No\")","v":"No"},{"$f":"IF(SellAllowed=\"Yes\",IF(AND(G1135 = \"Yes\", C1135<E1135), \"Yes\", \"No\"),\"No\")","v":"No"},{"$f":"IF(I1135 = \"Yes\", M1134/(C1135+CostBuy), IF(J1135 = \"Yes\", 0, K1134))","v":136521.07718088402},null,{"$f":"IF(I1135 = \"Yes\", M1134-(C1135+CostBuy)*K1135, IF(J1135=\"Yes\", M1134+(C1135-CostSell)*K1134, M1134+K1135*Rate))","v":129695.02332183889}]
[null,1964.07,83.22,78.923333333333332,77.541250000000005,null,"Yes",null,{"$f":"IF(BuyAllowed=\"Yes\",IF(AND(G1136 = \"No\", C1136>D1136), \"Yes\", \"No\"),\"No\")","v":"No"},{"$f":"IF(SellAllowed=\"Yes\",IF(AND(G1136 = \"Yes\", C1136<E1136), \"Yes\", \"No\"),\"No\")","v":"No"},{"$f":"IF(I1136 = \"Yes\", M1135/(C1136+CostBuy), IF(J1136 = \"Yes\", 0, K1135))","v":136521.07718088402},null,{"$f":"IF(I1136 = \"Yes\", M1135-(C1136+CostBuy)*K1136, IF(J1136=\"Yes\", M1135+(C1136-CostSell)*K1135, M1135+K1136*Rate))","v":136521.07718088309}]
[null,1964.08,82,80.051666666666677,78.866250000000008,null,"Yes",null,{"$f":"IF(BuyAllowed=\"Yes\",IF(AND(G1137 = \"No\", C1137>D1137), \"Yes\", \"No\"),\"No\")","v":"No"},{"$f":"IF(SellAllowed=\"Yes\",IF(AND(G1137 = \"Yes\", C1137<E1137), \"Yes\", \"No\"),\"No\")","v":"No"},{"$f":"IF(I1137 = \"Yes\", M1136/(C1137+CostBuy), IF(J1137 = \"Yes\", 0, K1136))","v":136521.07718088402},null,{"$f":"IF(I1137 = \"Yes\", M1136-(C1137+CostBuy)*K1137, IF(J1137=\"Yes\", M1136+(C1137-CostSell)*K1136, M1136+K1137*Rate))","v":143347.13103992731}]
[null,1964.09,83.41,80.819999999999993,79.844999999999999,null,"Yes",null,{"$f":"IF(BuyAllowed=\"Yes\",IF(AND(G1138 = \"No\", C1138>D1138), \"Yes\", \"No\"),\"No\")","v":"No"},{"$f":"IF(SellAllowed=\"Yes\",IF(AND(G1138 = \"Yes\", C1138<E1138), \"Yes\", \"No\"),\"No\")","v":"No"},{"$f":"IF(I1138 = \"Yes\", M1137/(C1138+CostBuy), IF(J1138 = \"Yes\", 0, K1137))","v":136521.07718088402},null,{"$f":"IF(I1138 = \"Yes\", M1137-(C1138+CostBuy)*K1138, IF(J1138=\"Yes\", M1137+(C1138-CostSell)*K1137, M1137+K1138*Rate))","v":150173.18489897152}]
[null,1964.1,84.85,81.588333333333324,80.715000000000003,null,"Yes",null,{"$f":"IF(BuyAllowed=\"Yes\",IF(AND(G1139 = \"No\", C1139>D1139), \"Yes\", \"No\"),\"No\")","v":"No"},{"$f":"IF(SellAllowed=\"Yes\",IF(AND(G1139 = \"Yes\", C1139<E1139), \"Yes\", \"No\"),\"No\")","v":"No"},{"$f":"IF(I1139 = \"Yes\", M1138/(C1139+CostBuy), IF(J1139 = \"Yes\", 0, K1138))","v":136521.07718088402},null,{"$f":"IF(I1139 = \"Yes\", M1138-(C1139+CostBuy)*K1139, IF(J1139=\"Yes\", M1138+(C1139-CostSell)*K1138, M1138+K1139*Rate))","v":156999.23875801574}]
[null,1964.11,85.44,82.406666666666652,81.647499999999994,null,"Yes",null,{"$f":"IF(BuyAllowed=\"Yes\",IF(AND(G1140 = \"No\", C1140>D1140), \"Yes\", \"No\"),\"No\")","v":"No"},{"$f":"IF(SellAllowed=\"Yes\",IF(AND(G1140 = \"Yes\", C1140<E1140), \"Yes\", \"No\"),\"No\")","v":"No"},{"$f":"IF(I1140 = \"Yes\", M1139/(C1140+CostBuy), IF(J1140 = \"Yes\", 0, K1139))","v":136521.07718088402},null,{"$f":"IF(I1140 = \"Yes\", M1139-(C1140+CostBuy)*K1140, IF(J1140=\"Yes\", M1139+(C1140-CostSell)*K1139, M1139+K1140*Rate))","v":163825.29261705995}]
[null,1964.12,83.96,83.193333333333342,82.477499999999992,null,"Yes",null,{"$f":"IF(BuyAllowed=\"Yes\",IF(AND(G1141 = \"No\", C1141>D1141), \"Yes\", \"No\"),\"No\")","v":"No"},{"$f":"IF(SellAllowed=\"Yes\",IF(AND(G1141 = \"Yes\", C1141<E1141), \"Yes\", \"No\"),\"No\")","v":"No"},{"$f":"IF(I1141 = \"Yes\", M1140/(C1141+CostBuy), IF(J1141 = \"Yes\", 0, K1140))","v":136521.07718088402},null,{"$f":"IF(I1141 = \"Yes\", M1140-(C1141+CostBuy)*K1141, IF(J1141=\"Yes\", M1140+(C1141-CostSell)*K1140, M1140+K1141*Rate))","v":170651.34647610417}]
[null,1965.01,86.12,83.813333333333333,82.97999999999999,null,"Yes",null,{"$f":"IF(BuyAllowed=\"Yes\",IF(AND(G1142 = \"No\", C1142>D1142), \"Yes\", \"No\"),\"No\")","v":"No"},{"$f":"IF(SellAllowed=\"Yes\",IF(AND(G1142 = \"Yes\", C1142<E1142), \"Yes\", \"No\"),\"No\")","v":"No"},{"$f":"IF(I1142 = \"Yes\", M1141/(C1142+CostBuy), IF(J1142 = \"Yes\", 0, K1141))","v":136521.07718088402},null,{"$f":"IF(I1142 = \"Yes\", M1141-(C1142+CostBuy)*K1142, IF(J1142=\"Yes\", M1141+(C1142-CostSell)*K1141, M1141+K1142*Rate))","v":177477.40033514838}]
[null,1965.02,86.75,84.296666666666667,83.655000000000001,null,"Yes",null,{"$f":"IF(BuyAllowed=\"Yes\",IF(AND(G1143 = \"No\", C1143>D1143), \"Yes\", \"No\"),\"No\")","v":"No"},{"$f":"IF(SellAllowed=\"Yes\",IF(AND(G1143 = \"Yes\", C1143<E1143), \"Yes\", \"No\"),\"No\")","v":"No"},{"$f":"IF(I1143 = \"Yes\", M1142/(C1143+CostBuy), IF(J1143 = \"Yes\", 0, K1142))","v":136521.07718088402},null,{"$f":"IF(I1143 = \"Yes\", M1142-(C1143+CostBuy)*K1143, IF(J1143=\"Yes\", M1142+(C1143-CostSell)*K1142, M1142+K1143*Rate))","v":184303.4541941926}]
[null,1965.03,86.83,85.088333333333324,84.46875,null,"Yes",null,{"$f":"IF(BuyAllowed=\"Yes\",IF(AND(G1144 = \"No\", C1144>D1144), \"Yes\", \"No\"),\"No\")","v":"No"},{"$f":"IF(SellAllowed=\"Yes\",IF(AND(G1144 = \"Yes\", C1144<E1144), \"Yes\", \"No\"),\"No\")","v":"No"},{"$f":"IF(I1144 = \"Yes\", M1143/(C1144+CostBuy), IF(J1144 = \"Yes\", 0, K1143))","v":136521.07718088402},null,{"$f":"IF(I1144 = \"Yes\", M1143-(C1144+CostBuy)*K1144, IF(J1144=\"Yes\", M1143+(C1144-CostSell)*K1143, M1143+K1144*Rate))","v":191129.50805323682}]
[null,1965.04,87.97,85.658333333333346,84.92,null,"Yes",null,{"$f":"IF(BuyAllowed=\"Yes\",IF(AND(G1145 = \"No\", C1145>D1145), \"Yes\", \"No\"),\"No\")","v":"No"},{"$f":"IF(SellAllowed=\"Yes\",IF(AND(G1145 = \"Yes\", C1145<E1145), \"Yes\", \"No\"),\"No\")","v":"No"},{"$f":"IF(I1145 = \"Yes\", M1144/(C1145+CostBuy), IF(J1145 = \"Yes\", 0, K1144))","v":136521.07718088402},null,{"$f":"IF(I1145 = \"Yes\", M1144-(C1145+CostBuy)*K1145, IF(J1145=\"Yes\", M1144+(C1145-CostSell)*K1144, M1144+K1145*Rate))","v":197955.56191228103}]
[null,1965.05,89.28,86.178333333333327,85.666250000000005,null,"Yes",null,{"$f":"IF(BuyAllowed=\"Yes\",IF(AND(G1146 = \"No\", C1146>D1146), \"Yes\", \"No\"),\"No\")","v":"No"},{"$f":"IF(SellAllowed=\"Yes\",IF(AND(G1146 = \"Yes\", C1146<E1146), \"Yes\", \"No\"),\"No\")","v":"No"},{"$f":"IF(I1146 = \"Yes\", M1145/(C1146+CostBuy), IF(J1146 = \"Yes\", 0, K1145))","v":136521.07718088402},null,{"$f":"IF(I1146 = \"Yes\", M1145-(C1146+CostBuy)*K1146, IF(J1146=\"Yes\", M1145+(C1146-CostSell)*K1145, M1145+K1146*Rate))","v":204781.61577132525}]
[null,1965.06,85.04,86.818333333333328,86.4,null,"Yes",null,{"$f":"IF(BuyAllowed=\"Yes\",IF(AND(G1147 = \"No\", C1147>D1147), \"Yes\", \"No\"),\"No\")","v":"No"},{"$f":"IF(SellAllowed=\"Yes\",IF(AND(G1147 = \"Yes\", C1147<E1147), \"Yes\", \"No\"),\"No\")","v":"Yes"},{"$f":"IF(I1147 = \"Yes\", M1146/(C1147+CostBuy), IF(J1147 = \"Yes\", 0, K1146))","v":0},null,{"$f":"IF(I1147 = \"Yes\", M1146-(C1147+CostBuy)*K1147, IF(J1147=\"Yes\", M1146+(C1147-CostSell)*K1146, M1146+K1147*Rate))","v":11806342.754602849}]
[null,1965.07,84.91,86.998333333333321,86.423749999999984,null,"No",null,{"$f":"IF(BuyAllowed=\"Yes\",IF(AND(G1148 = \"No\", C1148>D1148), \"Yes\", \"No\"),\"No\")","v":"No"},{"$f":"IF(SellAllowed=\"Yes\",IF(AND(G1148 = \"Yes\", C1148<E1148), \"Yes\", \"No\"),\"No\")","v":"No"},{"$f":"IF(I1148 = \"Yes\", M1147/(C1148+CostBuy), IF(J1148 = \"Yes\", 0, K1147))","v":0},null,{"$f":"IF(I1148 = \"Yes\", M1147-(C1148+CostBuy)*K1148, IF(J1148=\"Yes\", M1147+(C1148-CostSell)*K1147, M1147+K1148*Rate))","v":11806342.754602849}]
[null,1965.08,86.49,86.796666666666667,86.357499999999987,null,"No",null,{"$f":"IF(BuyAllowed=\"Yes\",IF(AND(G1149 = \"No\", C1149>D1149), \"Yes\", \"No\"),\"No\")","v":"No"},{"$f":"IF(SellAllowed=\"Yes\",IF(AND(G1149 = \"Yes\", C1149<E1149), \"Yes\", \"No\"),\"No\")","v":"No"},{"$f":"IF(I1149 = \"Yes\", M1148/(C1149+CostBuy), IF(J1149 = \"Yes\", 0, K1148))","v":0},null,{"$f":"IF(I1149 = \"Yes\", M1148-(C1149+CostBuy)*K1149, IF(J1149=\"Yes\", M1148+(C1149-CostSell)*K1148, M1148+K1149*Rate))","v":11806342.754602849}]
[null,1965.09,89.38,86.753333333333345,86.673749999999984,null,"No",null,{"$f":"IF(BuyAllowed=\"Yes\",IF(AND(G1150 = \"No\", C1150>D1150), \"Yes\", \"No\"),\"No\")","v":"Yes"},{"$f":"IF(SellAllowed=\"Yes\",IF(AND(G1150 = \"Yes\", C1150<E1150), \"Yes\", \"No\"),\"No\")","v":"No"},{"$f":"IF(I1150 = \"Yes\", M1149/(C1150+CostBuy), IF(J1150 = \"Yes\", 0, K1149))","v":132047.22910863272},null,{"$f":"IF(I1150 = \"Yes\", M1149-(C1150+CostBuy)*K1150, IF(J1150=\"Yes\", M1149+(C1150-CostSell)*K1149, M1149+K1150*Rate))","v":-1.862645149230957E-9}]
[null,1965.1,91.39,87.178333333333342,87.081249999999997,null,"Yes",null,{"$f":"IF(BuyAllowed=\"Yes\",IF(AND(G1151 = \"No\", C1151>D1151), \"Yes\", \"No\"),\"No\")","v":"No"},{"$f":"IF(SellAllowed=\"Yes\",IF(AND(G1151 = \"Yes\", C1151<E1151), \"Yes\", \"No\"),\"No\")","v":"No"},{"$f":"IF(I1151 = \"Yes\", M1150/(C1151+CostBuy), IF(J1151 = \"Yes\", 0, K1150))","v":132047.22910863272},null,{"$f":"IF(I1151 = \"Yes\", M1150-(C1151+CostBuy)*K1151, IF(J1151=\"Yes\", M1150+(C1151-CostSell)*K1150, M1150+K1151*Rate))","v":6602.3614554297737}]
[null,1965.11,92.15,87.748333333333335,87.66125000000001,null,"Yes",null,{"$f":"IF(BuyAllowed=\"Yes\",IF(AND(G1152 = \"No\", C1152>D1152), \"Yes\", \"No\"),\"No\")","v":"No"},{"$f":"IF(SellAllowed=\"Yes\",IF(AND(G1152 = \"Yes\", C1152<E1152), \"Yes\", \"No\"),\"No\")","v":"No"},{"$f":"IF(I1152 = \"Yes\", M1151/(C1152+CostBuy), IF(J1152 = \"Yes\", 0, K1151))","v":132047.22910863272},null,{"$f":"IF(I1152 = \"Yes\", M1151-(C1152+CostBuy)*K1152, IF(J1152=\"Yes\", M1151+(C1152-CostSell)*K1151, M1151+K1152*Rate))","v":13204.72291086141}]
[null,1965.12,91.73,88.226666666666674,88.326250000000002,null,"Yes",null,{"$f":"IF(BuyAllowed=\"Yes\",IF(AND(G1153 = \"No\", C1153>D1153), \"Yes\", \"No\"),\"No\")","v":"No"},{"$f":"IF(SellAllowed=\"Yes\",IF(AND(G1153 = \"Yes\", C1153<E1153), \"Yes\", \"No\"),\"No\")","v":"No"},{"$f":"IF(I1153 = \"Yes\", M1152/(C1153+CostBuy), IF(J1153 = \"Yes\", 0, K1152))","v":132047.22910863272},null,{"$f":"IF(I1153 = \"Yes\", M1152-(C1153+CostBuy)*K1153, IF(J1153=\"Yes\", M1152+(C1153-CostSell)*K1152, M1152+K1153*Rate))","v":19807.084366293046}]
[null,1966.01,93.32,89.341666666666654,88.796250000000001,null,"Yes",null,{"$f":"IF(BuyAllowed=\"Yes\",IF(AND(G1154 = \"No\", C1154>D1154), \"Yes\", \"No\"),\"No\")","v":"No"},{"$f":"IF(SellAllowed=\"Yes\",IF(AND(G1154 = \"Yes\", C1154<E1154), \"Yes\", \"No\"),\"No\")","v":"No"},{"$f":"IF(I1154 = \"Yes\", M1153/(C1154+CostBuy), IF(J1154 = \"Yes\", 0, K1153))","v":132047.22910863272},null,{"$f":"IF(I1154 = \"Yes\", M1153-(C1154+CostBuy)*K1154, IF(J1154=\"Yes\", M1153+(C1154-CostSell)*K1153, M1153+K1154*Rate))","v":26409.445821724683}]
[null,1966.02,92.69,90.743333333333339,89.30125000000001,null,"Yes",null,{"$f":"IF(BuyAllowed=\"Yes\",IF(AND(G1155 = \"No\", C1155>D1155), \"Yes\", \"No\"),\"No\")","v":"No"},{"$f":"IF(SellAllowed=\"Yes\",IF(AND(G1155 = \"Yes\", C1155<E1155), \"Yes\", \"No\"),\"No\")","v":"No"},{"$f":"IF(I1155 = \"Yes\", M1154/(C1155+CostBuy), IF(J1155 = \"Yes\", 0, K1154))","v":132047.22910863272},null,{"$f":"IF(I1155 = \"Yes\", M1154-(C1155+CostBuy)*K1155, IF(J1155=\"Yes\", M1154+(C1155-CostSell)*K1154, M1154+K1155*Rate))","v":33011.807277156317}]
[null,1966.03,88.88,91.776666666666657,90.257499999999993,null,"Yes",null,{"$f":"IF(BuyAllowed=\"Yes\",IF(AND(G1156 = \"No\", C1156>D1156), \"Yes\", \"No\"),\"No\")","v":"No"},{"$f":"IF(SellAllowed=\"Yes\",IF(AND(G1156 = \"Yes\", C1156<E1156), \"Yes\", \"No\"),\"No\")","v":"Yes"},{"$f":"IF(I1156 = \"Yes\", M1155/(C1156+CostBuy), IF(J1156 = \"Yes\", 0, K1155))","v":0},null,{"$f":"IF(I1156 = \"Yes\", M1155-(C1156+CostBuy)*K1156, IF(J1156=\"Yes\", M1155+(C1156-CostSell)*K1155, M1155+K1156*Rate))","v":11761446.696705913}]
[null,1966.04,91.6,91.693333333333342,90.753750000000011,null,"No",null,{"$f":"IF(BuyAllowed=\"Yes\",IF(AND(G1157 = \"No\", C1157>D1157), \"Yes\", \"No\"),\"No\")","v":"No"},{"$f":"IF(SellAllowed=\"Yes\",IF(AND(G1157 = \"Yes\", C1157<E1157), \"Yes\", \"No\"),\"No\")","v":"No"},{"$f":"IF(I1157 = \"Yes\", M1156/(C1157+CostBuy), IF(J1157 = \"Yes\", 0, K1156))","v":0},null,{"$f":"IF(I1157 = \"Yes\", M1156-(C1157+CostBuy)*K1157, IF(J1157=\"Yes\", M1156+(C1157-CostSell)*K1156, M1156+K1157*Rate))","v":11761446.696705913}]
[null,1966.05,86.78,91.728333333333339,91.392499999999998,null,"No",null,{"$f":"IF(BuyAllowed=\"Yes\",IF(AND(G1158 = \"No\", C1158>D1158), \"Yes\", \"No\"),\"No\")","v":"No"},{"$f":"IF(SellAllowed=\"Yes\",IF(AND(G1158 = \"Yes\", C1158<E1158), \"Yes\", \"No\"),\"No\")","v":"No"},{"$f":"IF(I1158 = \"Yes\", M1157/(C1158+CostBuy), IF(J1158 = \"Yes\", 0, K1157))","v":0},null,{"$f":"IF(I1158 = \"Yes\", M1157-(C1158+CostBuy)*K1158, IF(J1158=\"Yes\", M1157+(C1158-CostSell)*K1157, M1157+K1158*Rate))","v":11761446.696705913}]
[null,1966.06,86.06,90.833333333333329,91.06750000000001,null,"No",null,{"$f":"IF(BuyAllowed=\"Yes\",IF(AND(G1159 = \"No\", C1159>D1159), \"Yes\", \"No\"),\"No\")","v":"No"},{"$f":"IF(SellAllowed=\"Yes\",IF(AND(G1159 = \"Yes\", C1159<E1159), \"Yes\", \"No\"),\"No\")","v":"No"},{"$f":"IF(I1159 = \"Yes\", M1158/(C1159+CostBuy), IF(J1159 = \"Yes\", 0, K1158))","v":0},null,{"$f":"IF(I1159 = \"Yes\", M1158-(C1159+CostBuy)*K1159, IF(J1159=\"Yes\", M1158+(C1159-CostSell)*K1158, M1158+K1159*Rate))","v":11761446.696705913}]
[null,1966.07,85.84,89.888333333333321,90.401250000000005,null,"No",null,{"$f":"IF(BuyAllowed=\"Yes\",IF(AND(G1160 = \"No\", C1160>D1160), \"Yes\", \"No\"),\"No\")","v":"No"},{"$f":"IF(SellAllowed=\"Yes\",IF(AND(G1160 = \"Yes\", C1160<E1160), \"Yes\", \"No\"),\"No\")","v":"No"},{"$f":"IF(I1160 = \"Yes\", M1159/(C1160+CostBuy), IF(J1160 = \"Yes\", 0, K1159))","v":0},null,{"$f":"IF(I1160 = \"Yes\", M1159-(C1160+CostBuy)*K1160, IF(J1160=\"Yes\", M1159+(C1160-CostSell)*K1159, M1159+K1160*Rate))","v":11761446.696705913}]
[null,1966.08,80.650000000000006,88.641666666666652,89.612499999999997,null,"No",null,{"$f":"IF(BuyAllowed=\"Yes\",IF(AND(G1161 = \"No\", C1161>D1161), \"Yes\", \"No\"),\"No\")","v":"No"},{"$f":"IF(SellAllowed=\"Yes\",IF(AND(G1161 = \"Yes\", C1161<E1161), \"Yes\", \"No\"),\"No\")","v":"No"},{"$f":"IF(I1161 = \"Yes\", M1160/(C1161+CostBuy), IF(J1161 = \"Yes\", 0, K1160))","v":0},null,{"$f":"IF(I1161 = \"Yes\", M1160-(C1161+CostBuy)*K1161, IF(J1161=\"Yes\", M1160+(C1161-CostSell)*K1160, M1160+K1161*Rate))","v":11761446.696705913}]
[null,1966.09,77.81,86.634999999999991,88.227499999999992,null,"No",null,{"$f":"IF(BuyAllowed=\"Yes\",IF(AND(G1162 = \"No\", C1162>D1162), \"Yes\", \"No\"),\"No\")","v":"No"},{"$f":"IF(SellAllowed=\"Yes\",IF(AND(G1162 = \"Yes\", C1162<E1162), \"Yes\", \"No\"),\"No\")","v":"No"},{"$f":"IF(I1162 = \"Yes\", M1161/(C1162+CostBuy), IF(J1162 = \"Yes\", 0, K1161))","v":0},null,{"$f":"IF(I1162 = \"Yes\", M1161-(C1162+CostBuy)*K1162, IF(J1162=\"Yes\", M1161+(C1162-CostSell)*K1161, M1161+K1162*Rate))","v":11761446.696705913}]
[null,1966.1,77.13,84.789999999999992,86.288749999999993,null,"No",null,{"$f":"IF(BuyAllowed=\"Yes\",IF(AND(G1163 = \"No\", C1163>D1163), \"Yes\", \"No\"),\"No\")","v":"No"},{"$f":"IF(SellAllowed=\"Yes\",IF(AND(G1163 = \"Yes\", C1163<E1163), \"Yes\", \"No\"),\"No\")","v":"No"},{"$f":"IF(I1163 = \"Yes\", M1162/(C1163+CostBuy), IF(J1163 = \"Yes\", 0, K1162))","v":0},null,{"$f":"IF(I1163 = \"Yes\", M1162-(C1163+CostBuy)*K1163, IF(J1163=\"Yes\", M1162+(C1163-CostSell)*K1162, M1162+K1163*Rate))","v":11761446.696705913}]
[null,1966.11,80.989999999999995,82.378333333333345,84.343749999999986,null,"No",null,{"$f":"IF(BuyAllowed=\"Yes\",IF(AND(G1164 = \"No\", C1164>D1164), \"Yes\", \"No\"),\"No\")","v":"No"},{"$f":"IF(SellAllowed=\"Yes\",IF(AND(G1164 = \"Yes\", C1164<E1164), \"Yes\", \"No\"),\"No\")","v":"No"},{"$f":"IF(I1164 = \"Yes\", M1163/(C1164+CostBuy), IF(J1164 = \"Yes\", 0, K1163))","v":0},null,{"$f":"IF(I1164 = \"Yes\", M1163-(C1164+CostBuy)*K1164, IF(J1164=\"Yes\", M1163+(C1164-CostSell)*K1163, M1163+K1164*Rate))","v":11761446.696705913}]
[null,1966.12,81.33,81.413333333333341,83.357499999999987,null,"No",null,{"$f":"IF(BuyAllowed=\"Yes\",IF(AND(G1165 = \"No\", C1165>D1165), \"Yes\", \"No\"),\"No\")","v":"No"},{"$f":"IF(SellAllowed=\"Yes\",IF(AND(G1165 = \"Yes\", C1165<E1165), \"Yes\", \"No\"),\"No\")","v":"No"},{"$f":"IF(I1165 = \"Yes\", M1164/(C1165+CostBuy), IF(J1165 = \"Yes\", 0, K1164))","v":0},null,{"$f":"IF(I1165 = \"Yes\", M1164-(C1165+CostBuy)*K1165, IF(J1165=\"Yes\", M1164+(C1165-CostSell)*K1164, M1164+K1165*Rate))","v":11761446.696705913}]
[null,1967.01,84.45,80.625,82.073750000000004,null,"No",null,{"$f":"IF(BuyAllowed=\"Yes\",IF(AND(G1166 = \"No\", C1166>D1166), \"Yes\", \"No\"),\"No\")","v":"Yes"},{"$f":"IF(SellAllowed=\"Yes\",IF(AND(G1166 = \"Yes\", C1166<E1166), \"Yes\", \"No\"),\"No\")","v":"No"},{"$f":"IF(I1166 = \"Yes\", M1165/(C1166+CostBuy), IF(J1166 = \"Yes\", 0, K1165))","v":139221.67017881051},null,{"$f":"IF(I1166 = \"Yes\", M1165-(C1166+CostBuy)*K1166, IF(J1166=\"Yes\", M1165+(C1166-CostSell)*K1165, M1165+K1166*Rate))","v":0}]
[null,1967.02,87.36,80.393333333333331,81.782500000000013,null,"Yes",null,{"$f":"IF(BuyAllowed=\"Yes\",IF(AND(G1167 = \"No\", C1167>D1167), \"Yes\", \"No\"),\"No\")","v":"No"},{"$f":"IF(SellAllowed=\"Yes\",IF(AND(G1167 = \"Yes\", C1167<E1167), \"Yes\", \"No\"),\"No\")","v":"No"},{"$f":"IF(I1167 = \"Yes\", M1166/(C1167+CostBuy), IF(J1167 = \"Yes\", 0, K1166))","v":139221.67017881051},null,{"$f":"IF(I1167 = \"Yes\", M1166-(C1167+CostBuy)*K1167, IF(J1167=\"Yes\", M1166+(C1167-CostSell)*K1166, M1166+K1167*Rate))","v":6961.0835089405264}]
[null,1967.03,89.42,81.51166666666667,81.945000000000007,null,"Yes",null,{"$f":"IF(BuyAllowed=\"Yes\",IF(AND(G1168 = \"No\", C1168>D1168), \"Yes\", \"No\"),\"No\")","v":"No"},{"$f":"IF(SellAllowed=\"Yes\",IF(AND(G1168 = \"Yes\", C1168<E1168), \"Yes\", \"No\"),\"No\")","v":"No"},{"$f":"IF(I1168 = \"Yes\", M1167/(C1168+CostBuy), IF(J1168 = \"Yes\", 0, K1167))","v":139221.67017881051},null,{"$f":"IF(I1168 = \"Yes\", M1167-(C1168+CostBuy)*K1168, IF(J1168=\"Yes\", M1167+(C1168-CostSell)*K1167, M1167+K1168*Rate))","v":13922.167017881053}]
[null,1967.04,90.96,83.446666666666673,82.392499999999984,null,"Yes",null,{"$f":"IF(BuyAllowed=\"Yes\",IF(AND(G1169 = \"No\", C1169>D1169), \"Yes\", \"No\"),\"No\")","v":"No"},{"$f":"IF(SellAllowed=\"Yes\",IF(AND(G1169 = \"Yes\", C1169<E1169), \"Yes\", \"No\"),\"No\")","v":"No"},{"$f":"IF(I1169 = \"Yes\", M1168/(C1169+CostBuy), IF(J1169 = \"Yes\", 0, K1168))","v":139221.67017881051},null,{"$f":"IF(I1169 = \"Yes\", M1168-(C1169+CostBuy)*K1169, IF(J1169=\"Yes\", M1168+(C1169-CostSell)*K1168, M1168+K1169*Rate))","v":20883.250526821579}]
[null,1967.05,92.59,85.751666666666665,83.681250000000006,null,"Yes",null,{"$f":"IF(BuyAllowed=\"Yes\",IF(AND(G1170 = \"No\", C1170>D1170), \"Yes\", \"No\"),\"No\")","v":"No"},{"$f":"IF(SellAllowed=\"Yes\",IF(AND(G1170 = \"Yes\", C1170<E1170), \"Yes\", \"No\"),\"No\")","v":"No"},{"$f":"IF(I1170 = \"Yes\", M1169/(C1170+CostBuy), IF(J1170 = \"Yes\", 0, K1169))","v":139221.67017881051},null,{"$f":"IF(I1170 = \"Yes\", M1169-(C1170+CostBuy)*K1170, IF(J1170=\"Yes\", M1169+(C1170-CostSell)*K1169, M1169+K1170*Rate))","v":27844.334035762105}]
[null,1967.06,91.43,87.685000000000002,85.528750000000002,null,"Yes",null,{"$f":"IF(BuyAllowed=\"Yes\",IF(AND(G1171 = \"No\", C1171>D1171), \"Yes\", \"No\"),\"No\")","v":"No"},{"$f":"IF(SellAllowed=\"Yes\",IF(AND(G1171 = \"Yes\", C1171<E1171), \"Yes\", \"No\"),\"No\")","v":"No"},{"$f":"IF(I1171 = \"Yes\", M1170/(C1171+CostBuy), IF(J1171 = \"Yes\", 0, K1170))","v":139221.67017881051},null,{"$f":"IF(I1171 = \"Yes\", M1170-(C1171+CostBuy)*K1171, IF(J1171=\"Yes\", M1170+(C1171-CostSell)*K1170, M1170+K1171*Rate))","v":34805.417544702635}]
[null,1967.07,93.01,89.368333333333339,87.316249999999997,null,"Yes",null,{"$f":"IF(BuyAllowed=\"Yes\",IF(AND(G1172 = \"No\", C1172>D1172), \"Yes\", \"No\"),\"No\")","v":"No"},{"$f":"IF(SellAllowed=\"Yes\",IF(AND(G1172 = \"Yes\", C1172<E1172), \"Yes\", \"No\"),\"No\")","v":"No"},{"$f":"IF(I1172 = \"Yes\", M1171/(C1172+CostBuy), IF(J1172 = \"Yes\", 0, K1171))","v":139221.67017881051},null,{"$f":"IF(I1172 = \"Yes\", M1171-(C1172+CostBuy)*K1172, IF(J1172=\"Yes\", M1171+(C1172-CostSell)*K1171, M1171+K1172*Rate))","v":41766.501053643166}]
[null,1967.08,94.49,90.795000000000016,88.818749999999994,null,"Yes",null,{"$f":"IF(BuyAllowed=\"Yes\",IF(AND(G1173 = \"No\", C1173>D1173), \"Yes\", \"No\"),\"No\")","v":"No"},{"$f":"IF(SellAllowed=\"Yes\",IF(AND(G1173 = \"Yes\", C1173<E1173), \"Yes\", \"No\"),\"No\")","v":"No"},{"$f":"IF(I1173 = \"Yes\", M1172/(C1173+CostBuy), IF(J1173 = \"Yes\", 0, K1172))","v":139221.67017881051},null,{"$f":"IF(I1173 = \"Yes\", M1172-(C1173+CostBuy)*K1173, IF(J1173=\"Yes\", M1172+(C1173-CostSell)*K1172, M1172+K1173*Rate))","v":48727.584562583696}]
[null,1967.09,95.81,91.983333333333334,90.463750000000005,null,"Yes",null,{"$f":"IF(BuyAllowed=\"Yes\",IF(AND(G1174 = \"No\", C1174>D1174), \"Yes\", \"No\"),\"No\")","v":"No"},{"$f":"IF(SellAllowed=\"Yes\",IF(AND(G1174 = \"Yes\", C1174<E1174), \"Yes\", \"No\"),\"No\")","v":"No"},{"$f":"IF(I1174 = \"Yes\", M1173/(C1174+CostBuy), IF(J1174 = \"Yes\", 0, K1173))","v":139221.67017881051},null,{"$f":"IF(I1174 = \"Yes\", M1173-(C1174+CostBuy)*K1174, IF(J1174=\"Yes\", M1173+(C1174-CostSell)*K1173, M1173+K1174*Rate))","v":55688.668071524226}]
[null,1967.1,95.66,93.048333333333332,91.88375000000002,null,"Yes",null,{"$f":"IF(BuyAllowed=\"Yes\",IF(AND(G1175 = \"No\", C1175>D1175), \"Yes\", \"No\"),\"No\")","v":"No"},{"$f":"IF(SellAllowed=\"Yes\",IF(AND(G1175 = \"Yes\", C1175<E1175), \"Yes\", \"No\"),\"No\")","v":"No"},{"$f":"IF(I1175 = \"Yes\", M1174/(C1175+CostBuy), IF(J1175 = \"Yes\", 0, K1174))","v":139221.67017881051},null,{"$f":"IF(I1175 = \"Yes\", M1174-(C1175+CostBuy)*K1175, IF(J1175=\"Yes\", M1174+(C1175-CostSell)*K1174, M1174+K1175*Rate))","v":62649.751580464756}]
[null,1967.11,92.66,93.831666666666663,92.921250000000001,null,"Yes",null,{"$f":"IF(BuyAllowed=\"Yes\",IF(AND(G1176 = \"No\", C1176>D1176), \"Yes\", \"No\"),\"No\")","v":"No"},{"$f":"IF(SellAllowed=\"Yes\",IF(AND(G1176 = \"Yes\", C1176<E1176), \"Yes\", \"No\"),\"No\")","v":"Yes"},{"$f":"IF(I1176 = \"Yes\", M1175/(C1176+CostBuy), IF(J1176 = \"Yes\", 0, K1175))","v":0},null,{"$f":"IF(I1176 = \"Yes\", M1175-(C1176+CostBuy)*K1176, IF(J1176=\"Yes\", M1175+(C1176-CostSell)*K1175, M1175+K1176*Rate))","v":12954576.410138318}]
[null,1967.12,95.3,93.84333333333332,93.326249999999987,null,"No",null,{"$f":"IF(BuyAllowed=\"Yes\",IF(AND(G1177 = \"No\", C1177>D1177), \"Yes\", \"No\"),\"No\")","v":"Yes"},{"$f":"IF(SellAllowed=\"Yes\",IF(AND(G1177 = \"Yes\", C1177<E1177), \"Yes\", \"No\"),\"No\")","v":"No"},{"$f":"IF(I1177 = \"Yes\", M1176/(C1177+CostBuy), IF(J1177 = \"Yes\", 0, K1176))","v":135891.91660692665},null,{"$f":"IF(I1177 = \"Yes\", M1176-(C1177+CostBuy)*K1177, IF(J1177=\"Yes\", M1176+(C1177-CostSell)*K1176, M1176+K1177*Rate))","v":1.862645149230957E-9}]
[null,1968.01,95.04,94.48833333333333,93.868749999999991,null,"Yes",null,{"$f":"IF(BuyAllowed=\"Yes\",IF(AND(G1178 = \"No\", C1178>D1178), \"Yes\", \"No\"),\"No\")","v":"No"},{"$f":"IF(SellAllowed=\"Yes\",IF(AND(G1178 = \"Yes\", C1178<E1178), \"Yes\", \"No\"),\"No\")","v":"No"},{"$f":"IF(I1178 = \"Yes\", M1177/(C1178+CostBuy), IF(J1178 = \"Yes\", 0, K1177))","v":135891.91660692665},null,{"$f":"IF(I1178 = \"Yes\", M1177-(C1178+CostBuy)*K1178, IF(J1178=\"Yes\", M1177+(C1178-CostSell)*K1177, M1177+K1178*Rate))","v":6794.5958303481957}]
[null,1968.02,90.75,{"$f":"AVERAGE(C1173:C1178)","v":94.826666666666668},{"$f":"AVERAGE(C1171:C1178)","v":94.174999999999983},null,"Yes",null,{"$f":"IF(BuyAllowed=\"Yes\",IF(AND(G1179 = \"No\", C1179>D1179), \"Yes\", \"No\"),\"No\")","v":"No"},{"$f":"IF(SellAllowed=\"Yes\",IF(AND(G1179 = \"Yes\", C1179<E1179), \"Yes\", \"No\"),\"No\")","v":"Yes"},{"$f":"IF(I1179 = \"Yes\", M1178/(C1179+CostBuy), IF(J1179 = \"Yes\", 0, K1178))","v":0},null,{"$f":"IF(I1179 = \"Yes\", M1178-(C1179+CostBuy)*K1179, IF(J1179=\"Yes\", M1178+(C1179-CostSell)*K1178, M1178+K1179*Rate))","v":12330832.512912525}]
[null,1968.03,89.09,94.203333333333333,94.089999999999989,null,{"$f":"IF(I1179 = \"Yes\", \"Yes\", IF(J1179=\"Yes\", \"No\", G1179))","v":"No"},null,{"$f":"IF(BuyAllowed=\"Yes\",IF(AND(G1180 = \"No\", C1180>D1180), \"Yes\", \"No\"),\"No\")","v":"No"},{"$f":"IF(SellAllowed=\"Yes\",IF(AND(G1180 = \"Yes\", C1180<E1180), \"Yes\", \"No\"),\"No\")","v":"No"},{"$f":"IF(I1180 = \"Yes\", M1179/(C1180+CostBuy), IF(J1180 = \"Yes\", 0, K1179))","v":0},null,{"$f":"IF(I1180 = \"Yes\", M1179-(C1180+CostBuy)*K1180, IF(J1180=\"Yes\", M1179+(C1180-CostSell)*K1179, M1179+K1180*Rate))","v":12330832.512912525}]
[null,1968.04,95.67,93.083333333333329,93.600000000000009,null,"No",null,{"$f":"IF(BuyAllowed=\"Yes\",IF(AND(G1181 = \"No\", C1181>D1181), \"Yes\", \"No\"),\"No\")","v":"Yes"},{"$f":"IF(SellAllowed=\"Yes\",IF(AND(G1181 = \"Yes\", C1181<E1181), \"Yes\", \"No\"),\"No\")","v":"No"},{"$f":"IF(I1181 = \"Yes\", M1180/(C1181+CostBuy), IF(J1181 = \"Yes\", 0, K1180))","v":128848.82458633777},null,{"$f":"IF(I1181 = \"Yes\", M1180-(C1181+CostBuy)*K1181, IF(J1181=\"Yes\", M1180+(C1181-CostSell)*K1180, M1180+K1181*Rate))","v":0}]
[null,1968.05,97.87,93.084999999999994,93.747500000000002,null,"Yes",null,{"$f":"IF(BuyAllowed=\"Yes\",IF(AND(G1182 = \"No\", C1182>D1182), \"Yes\", \"No\"),\"No\")","v":"No"},{"$f":"IF(SellAllowed=\"Yes\",IF(AND(G1182 = \"Yes\", C1182<E1182), \"Yes\", \"No\"),\"No\")","v":"No"},{"$f":"IF(I1182 = \"Yes\", M1181/(C1182+CostBuy), IF(J1182 = \"Yes\", 0, K1181))","v":128848.82458633777},null,{"$f":"IF(I1182 = \"Yes\", M1181-(C1182+CostBuy)*K1182, IF(J1182=\"Yes\", M1181+(C1182-CostSell)*K1181, M1181+K1182*Rate))","v":6442.4412293168889}]
[null,1968.06,100.5,93.953333333333333,94.004999999999995,null,"Yes",null,{"$f":"IF(BuyAllowed=\"Yes\",IF(AND(G1183 = \"No\", C1183>D1183), \"Yes\", \"No\"),\"No\")","v":"No"},{"$f":"IF(SellAllowed=\"Yes\",IF(AND(G1183 = \"Yes\", C1183<E1183), \"Yes\", \"No\"),\"No\")","v":"No"},{"$f":"IF(I1183 = \"Yes\", M1182/(C1183+CostBuy), IF(J1183 = \"Yes\", 0, K1182))","v":128848.82458633777},null,{"$f":"IF(I1183 = \"Yes\", M1182-(C1183+CostBuy)*K1183, IF(J1183=\"Yes\", M1182+(C1183-CostSell)*K1182, M1182+K1183*Rate))","v":12884.882458633778}]
[null,1968.07,100.3,94.820000000000007,94.61,null,"Yes",null,{"$f":"IF(BuyAllowed=\"Yes\",IF(AND(G1184 = \"No\", C1184>D1184), \"Yes\", \"No\"),\"No\")","v":"No"},{"$f":"IF(SellAllowed=\"Yes\",IF(AND(G1184 = \"Yes\", C1184<E1184), \"Yes\", \"No\"),\"No\")","v":"No"},{"$f":"IF(I1184 = \"Yes\", M1183/(C1184+CostBuy), IF(J1184 = \"Yes\", 0, K1183))","v":128848.82458633777},null,{"$f":"IF(I1184 = \"Yes\", M1183-(C1184+CostBuy)*K1184, IF(J1184=\"Yes\", M1183+(C1184-CostSell)*K1183, M1183+K1184*Rate))","v":19327.323687950666}]
[null,1968.08,98.11,95.696666666666658,95.564999999999998,null,"Yes",null,{"$f":"IF(BuyAllowed=\"Yes\",IF(AND(G1185 = \"No\", C1185>D1185), \"Yes\", \"No\"),\"No\")","v":"No"},{"$f":"IF(SellAllowed=\"Yes\",IF(AND(G1185 = \"Yes\", C1185<E1185), \"Yes\", \"No\"),\"No\")","v":"No"},{"$f":"IF(I1185 = \"Yes\", M1184/(C1185+CostBuy), IF(J1185 = \"Yes\", 0, K1184))","v":128848.82458633777},null,{"$f":"IF(I1185 = \"Yes\", M1184-(C1185+CostBuy)*K1185, IF(J1185=\"Yes\", M1184+(C1185-CostSell)*K1184, M1184+K1185*Rate))","v":25769.764917267556}]
[null,1968.09,101.3,96.923333333333332,95.916250000000005,null,"Yes",null,{"$f":"IF(BuyAllowed=\"Yes\",IF(AND(G1186 = \"No\", C1186>D1186), \"Yes\", \"No\"),\"No\")","v":"No"},{"$f":"IF(SellAllowed=\"Yes\",IF(AND(G1186 = \"Yes\", C1186<E1186), \"Yes\", \"No\"),\"No\")","v":"No"},{"$f":"IF(I1186 = \"Yes\", M1185/(C1186+CostBuy), IF(J1186 = \"Yes\", 0, K1185))","v":128848.82458633777},null,{"$f":"IF(I1186 = \"Yes\", M1185-(C1186+CostBuy)*K1186, IF(J1186=\"Yes\", M1185+(C1186-CostSell)*K1185, M1185+K1186*Rate))","v":32212.206146584445}]
[null,1968.1,103.8,98.958333333333329,96.69874999999999,null,"Yes",null,{"$f":"IF(BuyAllowed=\"Yes\",IF(AND(G1187 = \"No\", C1187>D1187), \"Yes\", \"No\"),\"No\")","v":"No"},{"$f":"IF(SellAllowed=\"Yes\",IF(AND(G1187 = \"Yes\", C1187<E1187), \"Yes\", \"No\"),\"No\")","v":"No"},{"$f":"IF(I1187 = \"Yes\", M1186/(C1187+CostBuy), IF(J1187 = \"Yes\", 0, K1186))","v":128848.82458633777},null,{"$f":"IF(I1187 = \"Yes\", M1186-(C1187+CostBuy)*K1187, IF(J1187=\"Yes\", M1186+(C1187-CostSell)*K1186, M1186+K1187*Rate))","v":38654.647375901332}]
[null,1968.11,105.4,100.31333333333333,98.329999999999984,null,"Yes",null,{"$f":"IF(BuyAllowed=\"Yes\",IF(AND(G1188 = \"No\", C1188>D1188), \"Yes\", \"No\"),\"No\")","v":"No"},{"$f":"IF(SellAllowed=\"Yes\",IF(AND(G1188 = \"Yes\", C1188<E1188), \"Yes\", \"No\"),\"No\")","v":"No"},{"$f":"IF(I1188 = \"Yes\", M1187/(C1188+CostBuy), IF(J1188 = \"Yes\", 0, K1187))","v":128848.82458633777},null,{"$f":"IF(I1188 = \"Yes\", M1187-(C1188+CostBuy)*K1188, IF(J1188=\"Yes\", M1187+(C1188-CostSell)*K1187, M1187+K1188*Rate))","v":45097.088605218218}]
[null,1968.12,106.5,101.56833333333334,100.36874999999999,null,"Yes",null,{"$f":"IF(BuyAllowed=\"Yes\",IF(AND(G1189 = \"No\", C1189>D1189), \"Yes\", \"No\"),\"No\")","v":"No"},{"$f":"IF(SellAllowed=\"Yes\",IF(AND(G1189 = \"Yes\", C1189<E1189), \"Yes\", \"No\"),\"No\")","v":"No"},{"$f":"IF(I1189 = \"Yes\", M1188/(C1189+CostBuy), IF(J1189 = \"Yes\", 0, K1188))","v":128848.82458633777},null,{"$f":"IF(I1189 = \"Yes\", M1188-(C1189+CostBuy)*K1189, IF(J1189=\"Yes\", M1188+(C1189-CostSell)*K1188, M1188+K1189*Rate))","v":51539.529834535104}]
[null,1969.01,102,102.56833333333333,101.7225,null,"Yes",null,{"$f":"IF(BuyAllowed=\"Yes\",IF(AND(G1190 = \"No\", C1190>D1190), \"Yes\", \"No\"),\"No\")","v":"No"},{"$f":"IF(SellAllowed=\"Yes\",IF(AND(G1190 = \"Yes\", C1190<E1190), \"Yes\", \"No\"),\"No\")","v":"No"},{"$f":"IF(I1190 = \"Yes\", M1189/(C1190+CostBuy), IF(J1190 = \"Yes\", 0, K1189))","v":128848.82458633777},null,{"$f":"IF(I1190 = \"Yes\", M1189-(C1190+CostBuy)*K1190, IF(J1190=\"Yes\", M1189+(C1190-CostSell)*K1189, M1189+K1190*Rate))","v":57981.97106385199}]
[null,1969.02,101.5,102.85166666666667,102.23875000000001,null,"Yes",null,{"$f":"IF(BuyAllowed=\"Yes\",IF(AND(G1191 = \"No\", C1191>D1191), \"Yes\", \"No\"),\"No\")","v":"No"},{"$f":"IF(SellAllowed=\"Yes\",IF(AND(G1191 = \"Yes\", C1191<E1191), \"Yes\", \"No\"),\"No\")","v":"Yes"},{"$f":"IF(I1191 = \"Yes\", M1190/(C1191+CostBuy), IF(J1191 = \"Yes\", 0, K1190))","v":0},null,{"$f":"IF(I1191 = \"Yes\", M1190-(C1191+CostBuy)*K1191, IF(J1191=\"Yes\", M1190+(C1191-CostSell)*K1190, M1190+K1191*Rate))","v":13128406.737101955}]
[null,1969.03,99.3,103.41666666666667,102.36375,null,"No",null,{"$f":"IF(BuyAllowed=\"Yes\",IF(AND(G1192 = \"No\", C1192>D1192), \"Yes\", \"No\"),\"No\")","v":"No"},{"$f":"IF(SellAllowed=\"Yes\",IF(AND(G1192 = \"Yes\", C1192<E1192), \"Yes\", \"No\"),\"No\")","v":"No"},{"$f":"IF(I1192 = \"Yes\", M1191/(C1192+CostBuy), IF(J1192 = \"Yes\", 0, K1191))","v":0},null,{"$f":"IF(I1192 = \"Yes\", M1191-(C1192+CostBuy)*K1192, IF(J1192=\"Yes\", M1191+(C1192-CostSell)*K1191, M1191+K1192*Rate))","v":13128406.737101955}]
[null,1969.04,101.3,103.08333333333333,102.23875,null,"No",null,{"$f":"IF(BuyAllowed=\"Yes\",IF(AND(G1193 = \"No\", C1193>D1193), \"Yes\", \"No\"),\"No\")","v":"No"},{"$f":"IF(SellAllowed=\"Yes\",IF(AND(G1193 = \"Yes\", C1193<E1193), \"Yes\", \"No\"),\"No\")","v":"No"},{"$f":"IF(I1193 = \"Yes\", M1192/(C1193+CostBuy), IF(J1193 = \"Yes\", 0, K1192))","v":0},null,{"$f":"IF(I1193 = \"Yes\", M1192-(C1193+CostBuy)*K1193, IF(J1193=\"Yes\", M1192+(C1193-CostSell)*K1192, M1192+K1193*Rate))","v":13128406.737101955}]
[null,1969.05,104.6,102.66666666666664,102.63749999999999,null,"No",null,{"$f":"IF(BuyAllowed=\"Yes\",IF(AND(G1194 = \"No\", C1194>D1194), \"Yes\", \"No\"),\"No\")","v":"Yes"},{"$f":"IF(SellAllowed=\"Yes\",IF(AND(G1194 = \"Yes\", C1194<E1194), \"Yes\", \"No\"),\"No\")","v":"No"},{"$f":"IF(I1194 = \"Yes\", M1193/(C1194+CostBuy), IF(J1194 = \"Yes\", 0, K1193))","v":125474.59368347468},null,{"$f":"IF(I1194 = \"Yes\", M1193-(C1194+CostBuy)*K1194, IF(J1194=\"Yes\", M1193+(C1194-CostSell)*K1193, M1193+K1194*Rate))","v":0}]
[null,1969.06,99.14,102.53333333333335,103.05,null,"Yes",null,{"$f":"IF(BuyAllowed=\"Yes\",IF(AND(G1195 = \"No\", C1195>D1195), \"Yes\", \"No\"),\"No\")","v":"No"},{"$f":"IF(SellAllowed=\"Yes\",IF(AND(G1195 = \"Yes\", C1195<E1195), \"Yes\", \"No\"),\"No\")","v":"Yes"},{"$f":"IF(I1195 = \"Yes\", M1194/(C1195+CostBuy), IF(J1195 = \"Yes\", 0, K1194))","v":0},null,{"$f":"IF(I1195 = \"Yes\", M1194-(C1195+CostBuy)*K1195, IF(J1195=\"Yes\", M1194+(C1195-CostSell)*K1194, M1194+K1195*Rate))","v":12432022.742158672}]
[null,1969.07,94.71,101.30666666666667,102.46749999999999,null,"No",null,{"$f":"IF(BuyAllowed=\"Yes\",IF(AND(G1196 = \"No\", C1196>D1196), \"Yes\", \"No\"),\"No\")","v":"No"},{"$f":"IF(SellAllowed=\"Yes\",IF(AND(G1196 = \"Yes\", C1196<E1196), \"Yes\", \"No\"),\"No\")","v":"No"},{"$f":"IF(I1196 = \"Yes\", M1195/(C1196+CostBuy), IF(J1196 = \"Yes\", 0, K1195))","v":0},null,{"$f":"IF(I1196 = \"Yes\", M1195-(C1196+CostBuy)*K1196, IF(J1196=\"Yes\", M1195+(C1196-CostSell)*K1195, M1195+K1196*Rate))","v":12432022.742158672}]
[null,1969.08,94.18,100.09166666666668,101.13125000000001,null,"No",null,{"$f":"IF(BuyAllowed=\"Yes\",IF(AND(G1197 = \"No\", C1197>D1197), \"Yes\", \"No\"),\"No\")","v":"No"},{"$f":"IF(SellAllowed=\"Yes\",IF(AND(G1197 = \"Yes\", C1197<E1197), \"Yes\", \"No\"),\"No\")","v":"No"},{"$f":"IF(I1197 = \"Yes\", M1196/(C1197+CostBuy), IF(J1197 = \"Yes\", 0, K1196))","v":0},null,{"$f":"IF(I1197 = \"Yes\", M1196-(C1197+CostBuy)*K1197, IF(J1197=\"Yes\", M1196+(C1197-CostSell)*K1196, M1196+K1197*Rate))","v":12432022.742158672}]
[null,1969.09,94.51,98.87166666666667,99.591250000000002,null,"No",null,{"$f":"IF(BuyAllowed=\"Yes\",IF(AND(G1198 = \"No\", C1198>D1198), \"Yes\", \"No\"),\"No\")","v":"No"},{"$f":"IF(SellAllowed=\"Yes\",IF(AND(G1198 = \"Yes\", C1198<E1198), \"Yes\", \"No\"),\"No\")","v":"No"},{"$f":"IF(I1198 = \"Yes\", M1197/(C1198+CostBuy), IF(J1198 = \"Yes\", 0, K1197))","v":0},null,{"$f":"IF(I1198 = \"Yes\", M1197-(C1198+CostBuy)*K1198, IF(J1198=\"Yes\", M1197+(C1198-CostSell)*K1197, M1197+K1198*Rate))","v":12432022.742158672}]
[null,1969.1,95.52,98.073333333333323,98.655000000000001,null,"No",null,{"$f":"IF(BuyAllowed=\"Yes\",IF(AND(G1199 = \"No\", C1199>D1199), \"Yes\", \"No\"),\"No\")","v":"No"},{"$f":"IF(SellAllowed=\"Yes\",IF(AND(G1199 = \"Yes\", C1199<E1199), \"Yes\", \"No\"),\"No\")","v":"No"},{"$f":"IF(I1199 = \"Yes\", M1198/(C1199+CostBuy), IF(J1199 = \"Yes\", 0, K1198))","v":0},null,{"$f":"IF(I1199 = \"Yes\", M1198-(C1199+CostBuy)*K1199, IF(J1199=\"Yes\", M1198+(C1199-CostSell)*K1198, M1198+K1199*Rate))","v":12432022.742158672}]
[null,1969.11,96.21,97.11,97.907499999999999,null,"No",null,{"$f":"IF(BuyAllowed=\"Yes\",IF(AND(G1200 = \"No\", C1200>D1200), \"Yes\", \"No\"),\"No\")","v":"No"},{"$f":"IF(SellAllowed=\"Yes\",IF(AND(G1200 = \"Yes\", C1200<E1200), \"Yes\", \"No\"),\"No\")","v":"No"},{"$f":"IF(I1200 = \"Yes\", M1199/(C1200+CostBuy), IF(J1200 = \"Yes\", 0, K1199))","v":0},null,{"$f":"IF(I1200 = \"Yes\", M1199-(C1200+CostBuy)*K1200, IF(J1200=\"Yes\", M1199+(C1200-CostSell)*K1199, M1199+K1200*Rate))","v":12432022.742158672}]
[null,1969.12,91.11,95.711666666666659,97.521249999999995,null,"No",null,{"$f":"IF(BuyAllowed=\"Yes\",IF(AND(G1201 = \"No\", C1201>D1201), \"Yes\", \"No\"),\"No\")","v":"No"},{"$f":"IF(SellAllowed=\"Yes\",IF(AND(G1201 = \"Yes\", C1201<E1201), \"Yes\", \"No\"),\"No\")","v":"No"},{"$f":"IF(I1201 = \"Yes\", M1200/(C1201+CostBuy), IF(J1201 = \"Yes\", 0, K1200))","v":0},null,{"$f":"IF(I1201 = \"Yes\", M1200-(C1201+CostBuy)*K1201, IF(J1201=\"Yes\", M1200+(C1201-CostSell)*K1200, M1200+K1201*Rate))","v":12432022.742158672}]
[null,1970.01,90.31,94.373333333333321,96.247500000000002,null,"No",null,{"$f":"IF(BuyAllowed=\"Yes\",IF(AND(G1202 = \"No\", C1202>D1202), \"Yes\", \"No\"),\"No\")","v":"No"},{"$f":"IF(SellAllowed=\"Yes\",IF(AND(G1202 = \"Yes\", C1202<E1202), \"Yes\", \"No\"),\"No\")","v":"No"},{"$f":"IF(I1202 = \"Yes\", M1201/(C1202+CostBuy), IF(J1202 = \"Yes\", 0, K1201))","v":0},null,{"$f":"IF(I1202 = \"Yes\", M1201-(C1202+CostBuy)*K1202, IF(J1202=\"Yes\", M1201+(C1202-CostSell)*K1201, M1201+K1202*Rate))","v":12432022.742158672}]
[null,1970.02,87.16,93.639999999999986,94.461250000000007,null,"No",null,{"$f":"IF(BuyAllowed=\"Yes\",IF(AND(G1203 = \"No\", C1203>D1203), \"Yes\", \"No\"),\"No\")","v":"No"},{"$f":"IF(SellAllowed=\"Yes\",IF(AND(G1203 = \"Yes\", C1203<E1203), \"Yes\", \"No\"),\"No\")","v":"No"},{"$f":"IF(I1203 = \"Yes\", M1202/(C1203+CostBuy), IF(J1203 = \"Yes\", 0, K1202))","v":0},null,{"$f":"IF(I1203 = \"Yes\", M1202-(C1203+CostBuy)*K1203, IF(J1203=\"Yes\", M1202+(C1203-CostSell)*K1202, M1202+K1203*Rate))","v":12432022.742158672}]
[null,1970.03,88.65,92.470000000000013,92.96374999999999,null,"No",null,{"$f":"IF(BuyAllowed=\"Yes\",IF(AND(G1204 = \"No\", C1204>D1204), \"Yes\", \"No\"),\"No\")","v":"No"},{"$f":"IF(SellAllowed=\"Yes\",IF(AND(G1204 = \"Yes\", C1204<E1204), \"Yes\", \"No\"),\"No\")","v":"No"},{"$f":"IF(I1204 = \"Yes\", M1203/(C1204+CostBuy), IF(J1204 = \"Yes\", 0, K1203))","v":0},null,{"$f":"IF(I1204 = \"Yes\", M1203-(C1204+CostBuy)*K1204, IF(J1204=\"Yes\", M1203+(C1204-CostSell)*K1203, M1203+K1204*Rate))","v":12432022.742158672}]
[null,1970.04,85.95,91.493333333333325,92.206249999999983,null,"No",null,{"$f":"IF(BuyAllowed=\"Yes\",IF(AND(G1205 = \"No\", C1205>D1205), \"Yes\", \"No\"),\"No\")","v":"No"},{"$f":"IF(SellAllowed=\"Yes\",IF(AND(G1205 = \"Yes\", C1205<E1205), \"Yes\", \"No\"),\"No\")","v":"No"},{"$f":"IF(I1205 = \"Yes\", M1204/(C1205+CostBuy), IF(J1205 = \"Yes\", 0, K1204))","v":0},null,{"$f":"IF(I1205 = \"Yes\", M1204-(C1205+CostBuy)*K1205, IF(J1205=\"Yes\", M1204+(C1205-CostSell)*K1204, M1204+K1205*Rate))","v":12432022.742158672}]
[null,1970.05,76.06,89.898333333333326,91.177500000000009,null,"No",null,{"$f":"IF(BuyAllowed=\"Yes\",IF(AND(G1206 = \"No\", C1206>D1206), \"Yes\", \"No\"),\"No\")","v":"No"},{"$f":"IF(SellAllowed=\"Yes\",IF(AND(G1206 = \"Yes\", C1206<E1206), \"Yes\", \"No\"),\"No\")","v":"No"},{"$f":"IF(I1206 = \"Yes\", M1205/(C1206+CostBuy), IF(J1206 = \"Yes\", 0, K1205))","v":0},null,{"$f":"IF(I1206 = \"Yes\", M1205-(C1206+CostBuy)*K1206, IF(J1206=\"Yes\", M1205+(C1206-CostSell)*K1205, M1205+K1206*Rate))","v":12432022.742158672}]
[null,1970.06,75.59,86.54,88.871250000000003,null,"No",null,{"$f":"IF(BuyAllowed=\"Yes\",IF(AND(G1207 = \"No\", C1207>D1207), \"Yes\", \"No\"),\"No\")","v":"No"},{"$f":"IF(SellAllowed=\"Yes\",IF(AND(G1207 = \"Yes\", C1207<E1207), \"Yes\", \"No\"),\"No\")","v":"No"},{"$f":"IF(I1207 = \"Yes\", M1206/(C1207+CostBuy), IF(J1207 = \"Yes\", 0, K1206))","v":0},null,{"$f":"IF(I1207 = \"Yes\", M1206-(C1207+CostBuy)*K1207, IF(J1207=\"Yes\", M1206+(C1207-CostSell)*K1206, M1206+K1207*Rate))","v":12432022.742158672}]
[null,1970.07,75.72,83.953333333333333,86.38000000000001,null,"No",null,{"$f":"IF(BuyAllowed=\"Yes\",IF(AND(G1208 = \"No\", C1208>D1208), \"Yes\", \"No\"),\"No\")","v":"No"},{"$f":"IF(SellAllowed=\"Yes\",IF(AND(G1208 = \"Yes\", C1208<E1208), \"Yes\", \"No\"),\"No\")","v":"No"},{"$f":"IF(I1208 = \"Yes\", M1207/(C1208+CostBuy), IF(J1208 = \"Yes\", 0, K1207))","v":0},null,{"$f":"IF(I1208 = \"Yes\", M1207-(C1208+CostBuy)*K1208, IF(J1208=\"Yes\", M1207+(C1208-CostSell)*K1207, M1207+K1208*Rate))","v":12432022.742158672}]
[null,1970.08,77.92,81.521666666666661,83.818750000000009,null,"No",null,{"$f":"IF(BuyAllowed=\"Yes\",IF(AND(G1209 = \"No\", C1209>D1209), \"Yes\", \"No\"),\"No\")","v":"No"},{"$f":"IF(SellAllowed=\"Yes\",IF(AND(G1209 = \"Yes\", C1209<E1209), \"Yes\", \"No\"),\"No\")","v":"No"},{"$f":"IF(I1209 = \"Yes\", M1208/(C1209+CostBuy), IF(J1209 = \"Yes\", 0, K1208))","v":0},null,{"$f":"IF(I1209 = \"Yes\", M1208-(C1209+CostBuy)*K1209, IF(J1209=\"Yes\", M1208+(C1209-CostSell)*K1208, M1208+K1209*Rate))","v":12432022.742158672}]
[null,1970.09,82.58,79.981666666666669,82.17,null,"No",null,{"$f":"IF(BuyAllowed=\"Yes\",IF(AND(G1210 = \"No\", C1210>D1210), \"Yes\", \"No\"),\"No\")","v":"Yes"},{"$f":"IF(SellAllowed=\"Yes\",IF(AND(G1210 = \"Yes\", C1210<E1210), \"Yes\", \"No\"),\"No\")","v":"No"},{"$f":"IF(I1210 = \"Yes\", M1209/(C1210+CostBuy), IF(J1210 = \"Yes\", 0, K1209))","v":150490.53071248846},null,{"$f":"IF(I1210 = \"Yes\", M1209-(C1210+CostBuy)*K1210, IF(J1210=\"Yes\", M1209+(C1210-CostSell)*K1209, M1209+K1210*Rate))","v":0}]
[null,1970.1,84.37,78.97,81.203749999999999,null,"Yes",null,{"$f":"IF(BuyAllowed=\"Yes\",IF(AND(G1211 = \"No\", C1211>D1211), \"Yes\", \"No\"),\"No\")","v":"No"},{"$f":"IF(SellAllowed=\"Yes\",IF(AND(G1211 = \"Yes\", C1211<E1211), \"Yes\", \"No\"),\"No\")","v":"No"},{"$f":"IF(I1211 = \"Yes\", M1210/(C1211+CostBuy), IF(J1211 = \"Yes\", 0, K1210))","v":150490.53071248846},null,{"$f":"IF(I1211 = \"Yes\", M1210-(C1211+CostBuy)*K1211, IF(J1211=\"Yes\", M1210+(C1211-CostSell)*K1210, M1210+K1211*Rate))","v":7524.5265356244236}]
[null,1970.11,84.28,78.706666666666663,80.855000000000004,null,"Yes",null,{"$f":"IF(BuyAllowed=\"Yes\",IF(AND(G1212 = \"No\", C1212>D1212), \"Yes\", \"No\"),\"No\")","v":"No"},{"$f":"IF(SellAllowed=\"Yes\",IF(AND(G1212 = \"Yes\", C1212<E1212), \"Yes\", \"No\"),\"No\")","v":"No"},{"$f":"IF(I1212 = \"Yes\", M1211/(C1212+CostBuy), IF(J1212 = \"Yes\", 0, K1211))","v":150490.53071248846},null,{"$f":"IF(I1212 = \"Yes\", M1211-(C1212+CostBuy)*K1212, IF(J1212=\"Yes\", M1211+(C1212-CostSell)*K1211, M1211+K1212*Rate))","v":15049.053071248847}]
[null,1970.12,90.05,80.076666666666668,80.308750000000003,null,"Yes",null,{"$f":"IF(BuyAllowed=\"Yes\",IF(AND(G1213 = \"No\", C1213>D1213), \"Yes\", \"No\"),\"No\")","v":"No"},{"$f":"IF(SellAllowed=\"Yes\",IF(AND(G1213 = \"Yes\", C1213<E1213), \"Yes\", \"No\"),\"No\")","v":"No"},{"$f":"IF(I1213 = \"Yes\", M1212/(C1213+CostBuy), IF(J1213 = \"Yes\", 0, K1212))","v":150490.53071248846},null,{"$f":"IF(I1213 = \"Yes\", M1212-(C1213+CostBuy)*K1213, IF(J1213=\"Yes\", M1212+(C1213-CostSell)*K1212, M1212+K1213*Rate))","v":22573.579606873271}]
[null,1971.01,93.49,82.486666666666665,80.821249999999992,null,"Yes",null,{"$f":"IF(BuyAllowed=\"Yes\",IF(AND(G1214 = \"No\", C1214>D1214), \"Yes\", \"No\"),\"No\")","v":"No"},{"$f":"IF(SellAllowed=\"Yes\",IF(AND(G1214 = \"Yes\", C1214<E1214), \"Yes\", \"No\"),\"No\")","v":"No"},{"$f":"IF(I1214 = \"Yes\", M1213/(C1214+CostBuy), IF(J1214 = \"Yes\", 0, K1213))","v":150490.53071248846},null,{"$f":"IF(I1214 = \"Yes\", M1213-(C1214+CostBuy)*K1214, IF(J1214=\"Yes\", M1213+(C1214-CostSell)*K1213, M1213+K1214*Rate))","v":30098.106142497694}]
[null,1971.02,97.11,85.448333333333323,83,null,"Yes",null,{"$f":"IF(BuyAllowed=\"Yes\",IF(AND(G1215 = \"No\", C1215>D1215), \"Yes\", \"No\"),\"No\")","v":"No"},{"$f":"IF(SellAllowed=\"Yes\",IF(AND(G1215 = \"Yes\", C1215<E1215), \"Yes\", \"No\"),\"No\")","v":"No"},{"$f":"IF(I1215 = \"Yes\", M1214/(C1215+CostBuy), IF(J1215 = \"Yes\", 0, K1214))","v":150490.53071248846},null,{"$f":"IF(I1215 = \"Yes\", M1214-(C1215+CostBuy)*K1215, IF(J1215=\"Yes\", M1214+(C1215-CostSell)*K1214, M1214+K1215*Rate))","v":37622.632678122114}]
[null,1971.03,99.6,88.646666666666661,85.69,null,"Yes",null,{"$f":"IF(BuyAllowed=\"Yes\",IF(AND(G1216 = \"No\", C1216>D1216), \"Yes\", \"No\"),\"No\")","v":"No"},{"$f":"IF(SellAllowed=\"Yes\",IF(AND(G1216 = \"Yes\", C1216<E1216), \"Yes\", \"No\"),\"No\")","v":"No"},{"$f":"IF(I1216 = \"Yes\", M1215/(C1216+CostBuy), IF(J1216 = \"Yes\", 0, K1215))","v":150490.53071248846},null,{"$f":"IF(I1216 = \"Yes\", M1215-(C1216+CostBuy)*K1216, IF(J1216=\"Yes\", M1215+(C1216-CostSell)*K1215, M1215+K1216*Rate))","v":45147.159213746534}]
[null,1971.04,103,91.483333333333334,88.674999999999997,null,"Yes",null,{"$f":"IF(BuyAllowed=\"Yes\",IF(AND(G1217 = \"No\", C1217>D1217), \"Yes\", \"No\"),\"No\")","v":"No"},{"$f":"IF(SellAllowed=\"Yes\",IF(AND(G1217 = \"Yes\", C1217<E1217), \"Yes\", \"No\"),\"No\")","v":"No"},{"$f":"IF(I1217 = \"Yes\", M1216/(C1217+CostBuy), IF(J1217 = \"Yes\", 0, K1216))","v":150490.53071248846},null,{"$f":"IF(I1217 = \"Yes\", M1216-(C1217+CostBuy)*K1217, IF(J1217=\"Yes\", M1216+(C1217-CostSell)*K1216, M1216+K1217*Rate))","v":52671.685749370954}]
[null,1971.05,101.6,94.588333333333324,91.81,null,"Yes",null,{"$f":"IF(BuyAllowed=\"Yes\",IF(AND(G1218 = \"No\", C1218>D1218), \"Yes\", \"No\"),\"No\")","v":"No"},{"$f":"IF(SellAllowed=\"Yes\",IF(AND(G1218 = \"Yes\", C1218<E1218), \"Yes\", \"No\"),\"No\")","v":"No"},{"$f":"IF(I1218 = \"Yes\", M1217/(C1218+CostBuy), IF(J1218 = \"Yes\", 0, K1217))","v":150490.53071248846},null,{"$f":"IF(I1218 = \"Yes\", M1217-(C1218+CostBuy)*K1218, IF(J1218=\"Yes\", M1217+(C1218-CostSell)*K1217, M1217+K1218*Rate))","v":60196.212284995374}]
[null,1971.06,99.72,97.475000000000009,94.1875,null,"Yes",null,{"$f":"IF(BuyAllowed=\"Yes\",IF(AND(G1219 = \"No\", C1219>D1219), \"Yes\", \"No\"),\"No\")","v":"No"},{"$f":"IF(SellAllowed=\"Yes\",IF(AND(G1219 = \"Yes\", C1219<E1219), \"Yes\", \"No\"),\"No\")","v":"No"},{"$f":"IF(I1219 = \"Yes\", M1218/(C1219+CostBuy), IF(J1219 = \"Yes\", 0, K1218))","v":150490.53071248846},null,{"$f":"IF(I1219 = \"Yes\", M1218-(C1219+CostBuy)*K1219, IF(J1219=\"Yes\", M1218+(C1219-CostSell)*K1218, M1218+K1219*Rate))","v":67720.738820619794}]
[null,1971.07,99,99.086666666666659,96.106250000000003,null,"Yes",null,{"$f":"IF(BuyAllowed=\"Yes\",IF(AND(G1220 = \"No\", C1220>D1220), \"Yes\", \"No\"),\"No\")","v":"No"},{"$f":"IF(SellAllowed=\"Yes\",IF(AND(G1220 = \"Yes\", C1220<E1220), \"Yes\", \"No\"),\"No\")","v":"No"},{"$f":"IF(I1220 = \"Yes\", M1219/(C1220+CostBuy), IF(J1220 = \"Yes\", 0, K1219))","v":150490.53071248846},null,{"$f":"IF(I1220 = \"Yes\", M1219-(C1220+CostBuy)*K1220, IF(J1220=\"Yes\", M1219+(C1220-CostSell)*K1219, M1219+K1220*Rate))","v":75245.265356244214}]
[null,1971.08,97.24,100.005,97.946250000000006,null,"Yes",null,{"$f":"IF(BuyAllowed=\"Yes\",IF(AND(G1221 = \"No\", C1221>D1221), \"Yes\", \"No\"),\"No\")","v":"No"},{"$f":"IF(SellAllowed=\"Yes\",IF(AND(G1221 = \"Yes\", C1221<E1221), \"Yes\", \"No\"),\"No\")","v":"Yes"},{"$f":"IF(I1221 = \"Yes\", M1220/(C1221+CostBuy), IF(J1221 = \"Yes\", 0, K1220))","v":0},null,{"$f":"IF(I1221 = \"Yes\", M1220-(C1221+CostBuy)*K1221, IF(J1221=\"Yes\", M1220+(C1221-CostSell)*K1220, M1220+K1221*Rate))","v":14699915.039995871}]
[null,1971.09,99.4,100.02666666666666,98.844999999999999,null,"No",null,{"$f":"IF(BuyAllowed=\"Yes\",IF(AND(G1222 = \"No\", C1222>D1222), \"Yes\", \"No\"),\"No\")","v":"No"},{"$f":"IF(SellAllowed=\"Yes\",IF(AND(G1222 = \"Yes\", C1222<E1222), \"Yes\", \"No\"),\"No\")","v":"No"},{"$f":"IF(I1222 = \"Yes\", M1221/(C1222+CostBuy), IF(J1222 = \"Yes\", 0, K1221))","v":0},null,{"$f":"IF(I1222 = \"Yes\", M1221-(C1222+CostBuy)*K1222, IF(J1222=\"Yes\", M1221+(C1222-CostSell)*K1221, M1221+K1222*Rate))","v":14699915.039995871}]
[null,1971.1,97.29,99.993333333333339,99.583749999999995,null,"No",null,{"$f":"IF(BuyAllowed=\"Yes\",IF(AND(G1223 = \"No\", C1223>D1223), \"Yes\", \"No\"),\"No\")","v":"No"},{"$f":"IF(SellAllowed=\"Yes\",IF(AND(G1223 = \"Yes\", C1223<E1223), \"Yes\", \"No\"),\"No\")","v":"No"},{"$f":"IF(I1223 = \"Yes\", M1222/(C1223+CostBuy), IF(J1223 = \"Yes\", 0, K1222))","v":0},null,{"$f":"IF(I1223 = \"Yes\", M1222-(C1223+CostBuy)*K1223, IF(J1223=\"Yes\", M1222+(C1223-CostSell)*K1222, M1222+K1223*Rate))","v":14699915.039995871}]
[null,1971.11,92.78,99.041666666666671,99.606249999999989,null,"No",null,{"$f":"IF(BuyAllowed=\"Yes\",IF(AND(G1224 = \"No\", C1224>D1224), \"Yes\", \"No\"),\"No\")","v":"No"},{"$f":"IF(SellAllowed=\"Yes\",IF(AND(G1224 = \"Yes\", C1224<E1224), \"Yes\", \"No\"),\"No\")","v":"No"},{"$f":"IF(I1224 = \"Yes\", M1223/(C1224+CostBuy), IF(J1224 = \"Yes\", 0, K1223))","v":0},null,{"$f":"IF(I1224 = \"Yes\", M1223-(C1224+CostBuy)*K1224, IF(J1224=\"Yes\", M1223+(C1224-CostSell)*K1223, M1223+K1224*Rate))","v":14699915.039995871}]
[null,1971.12,99.17,97.571666666666673,98.753749999999997,null,"No",null,{"$f":"IF(BuyAllowed=\"Yes\",IF(AND(G1225 = \"No\", C1225>D1225), \"Yes\", \"No\"),\"No\")","v":"Yes"},{"$f":"IF(SellAllowed=\"Yes\",IF(AND(G1225 = \"Yes\", C1225<E1225), \"Yes\", \"No\"),\"No\")","v":"No"},{"$f":"IF(I1225 = \"Yes\", M1224/(C1225+CostBuy), IF(J1225 = \"Yes\", 0, K1224))","v":148184.62741931321},null,{"$f":"IF(I1225 = \"Yes\", M1224-(C1225+CostBuy)*K1225, IF(J1225=\"Yes\", M1224+(C1225-CostSell)*K1224, M1224+K1225*Rate))","v":0}]
[null,1972.01,103.3,97.48,98.274999999999991,null,"Yes",null,{"$f":"IF(BuyAllowed=\"Yes\",IF(AND(G1226 = \"No\", C1226>D1226), \"Yes\", \"No\"),\"No\")","v":"No"},{"$f":"IF(SellAllowed=\"Yes\",IF(AND(G1226 = \"Yes\", C1226<E1226), \"Yes\", \"No\"),\"No\")","v":"No"},{"$f":"IF(I1226 = \"Yes\", M1225/(C1226+CostBuy), IF(J1226 = \"Yes\", 0, K1225))","v":148184.62741931321},null,{"$f":"IF(I1226 = \"Yes\", M1225-(C1226+CostBuy)*K1226, IF(J1226=\"Yes\", M1225+(C1226-CostSell)*K1225, M1225+K1226*Rate))","v":7409.231370965661}]
[null,1972.02,105.2,98.196666666666673,98.487499999999997,null,"Yes",null,{"$f":"IF(BuyAllowed=\"Yes\",IF(AND(G1227 = \"No\", C1227>D1227), \"Yes\", \"No\"),\"No\")","v":"No"},{"$f":"IF(SellAllowed=\"Yes\",IF(AND(G1227 = \"Yes\", C1227<E1227), \"Yes\", \"No\"),\"No\")","v":"No"},{"$f":"IF(I1227 = \"Yes\", M1226/(C1227+CostBuy), IF(J1227 = \"Yes\", 0, K1226))","v":148184.62741931321},null,{"$f":"IF(I1227 = \"Yes\", M1226-(C1227+CostBuy)*K1227, IF(J1227=\"Yes\", M1226+(C1227-CostSell)*K1226, M1226+K1227*Rate))","v":14818.462741931322}]
[null,1972.03,107.7,99.523333333333355,99.172499999999999,null,"Yes",null,{"$f":"IF(BuyAllowed=\"Yes\",IF(AND(G1228 = \"No\", C1228>D1228), \"Yes\", \"No\"),\"No\")","v":"No"},{"$f":"IF(SellAllowed=\"Yes\",IF(AND(G1228 = \"Yes\", C1228<E1228), \"Yes\", \"No\"),\"No\")","v":"No"},{"$f":"IF(I1228 = \"Yes\", M1227/(C1228+CostBuy), IF(J1228 = \"Yes\", 0, K1227))","v":148184.62741931321},null,{"$f":"IF(I1228 = \"Yes\", M1227-(C1228+CostBuy)*K1228, IF(J1228=\"Yes\", M1227+(C1228-CostSell)*K1227, M1227+K1228*Rate))","v":22227.694112896985}]
[null,1972.04,108.8,100.90666666666668,100.26000000000002,null,"Yes",null,{"$f":"IF(BuyAllowed=\"Yes\",IF(AND(G1229 = \"No\", C1229>D1229), \"Yes\", \"No\"),\"No\")","v":"No"},{"$f":"IF(SellAllowed=\"Yes\",IF(AND(G1229 = \"Yes\", C1229<E1229), \"Yes\", \"No\"),\"No\")","v":"No"},{"$f":"IF(I1229 = \"Yes\", M1228/(C1229+CostBuy), IF(J1229 = \"Yes\", 0, K1228))","v":148184.62741931321},null,{"$f":"IF(I1229 = \"Yes\", M1228-(C1229+CostBuy)*K1229, IF(J1229=\"Yes\", M1228+(C1229-CostSell)*K1228, M1228+K1229*Rate))","v":29636.925483862644}]
[null,1972.05,107.7,102.82499999999999,101.70500000000001,null,"Yes",null,{"$f":"IF(BuyAllowed=\"Yes\",IF(AND(G1230 = \"No\", C1230>D1230), \"Yes\", \"No\"),\"No\")","v":"No"},{"$f":"IF(SellAllowed=\"Yes\",IF(AND(G1230 = \"Yes\", C1230<E1230), \"Yes\", \"No\"),\"No\")","v":"No"},{"$f":"IF(I1230 = \"Yes\", M1229/(C1230+CostBuy), IF(J1230 = \"Yes\", 0, K1229))","v":148184.62741931321},null,{"$f":"IF(I1230 = \"Yes\", M1229-(C1230+CostBuy)*K1230, IF(J1230=\"Yes\", M1229+(C1230-CostSell)*K1229, M1229+K1230*Rate))","v":37046.156854828303}]
[null,1972.06,108,105.31166666666667,102.74250000000001,null,"Yes",null,{"$f":"IF(BuyAllowed=\"Yes\",IF(AND(G1231 = \"No\", C1231>D1231), \"Yes\", \"No\"),\"No\")","v":"No"},{"$f":"IF(SellAllowed=\"Yes\",IF(AND(G1231 = \"Yes\", C1231<E1231), \"Yes\", \"No\"),\"No\")","v":"No"},{"$f":"IF(I1231 = \"Yes\", M1230/(C1231+CostBuy), IF(J1231 = \"Yes\", 0, K1230))","v":148184.62741931321},null,{"$f":"IF(I1231 = \"Yes\", M1230-(C1231+CostBuy)*K1231, IF(J1231=\"Yes\", M1230+(C1231-CostSell)*K1230, M1230+K1231*Rate))","v":44455.388225793962}]
[null,1972.07,107.2,106.78333333333335,104.08125,null,"Yes",null,{"$f":"IF(BuyAllowed=\"Yes\",IF(AND(G1232 = \"No\", C1232>D1232), \"Yes\", \"No\"),\"No\")","v":"No"},{"$f":"IF(SellAllowed=\"Yes\",IF(AND(G1232 = \"Yes\", C1232<E1232), \"Yes\", \"No\"),\"No\")","v":"No"},{"$f":"IF(I1232 = \"Yes\", M1231/(C1232+CostBuy), IF(J1232 = \"Yes\", 0, K1231))","v":148184.62741931321},null,{"$f":"IF(I1232 = \"Yes\", M1231-(C1232+CostBuy)*K1232, IF(J1232=\"Yes\", M1231+(C1232-CostSell)*K1231, M1231+K1232*Rate))","v":51864.619596759621}]
[null,1972.08,111,107.43333333333334,105.88375000000001,null,"Yes",null,{"$f":"IF(BuyAllowed=\"Yes\",IF(AND(G1233 = \"No\", C1233>D1233), \"Yes\", \"No\"),\"No\")","v":"No"},{"$f":"IF(SellAllowed=\"Yes\",IF(AND(G1233 = \"Yes\", C1233<E1233), \"Yes\", \"No\"),\"No\")","v":"No"},{"$f":"IF(I1233 = \"Yes\", M1232/(C1233+CostBuy), IF(J1233 = \"Yes\", 0, K1232))","v":148184.62741931321},null,{"$f":"IF(I1233 = \"Yes\", M1232-(C1233+CostBuy)*K1233, IF(J1233=\"Yes\", M1232+(C1233-CostSell)*K1232, M1232+K1233*Rate))","v":59273.85096772528}]
[null,1972.09,109.4,108.39999999999999,107.36250000000001,null,"Yes",null,{"$f":"IF(BuyAllowed=\"Yes\",IF(AND(G1234 = \"No\", C1234>D1234), \"Yes\", \"No\"),\"No\")","v":"No"},{"$f":"IF(SellAllowed=\"Yes\",IF(AND(G1234 = \"Yes\", C1234<E1234), \"Yes\", \"No\"),\"No\")","v":"No"},{"$f":"IF(I1234 = \"Yes\", M1233/(C1234+CostBuy), IF(J1234 = \"Yes\", 0, K1233))","v":148184.62741931321},null,{"$f":"IF(I1234 = \"Yes\", M1233-(C1234+CostBuy)*K1234, IF(J1234=\"Yes\", M1233+(C1234-CostSell)*K1233, M1233+K1234*Rate))","v":66683.082338690947}]
[null,1972.1,109.6,108.68333333333334,108.125,null,"Yes",null,{"$f":"IF(BuyAllowed=\"Yes\",IF(AND(G1235 = \"No\", C1235>D1235), \"Yes\", \"No\"),\"No\")","v":"No"},{"$f":"IF(SellAllowed=\"Yes\",IF(AND(G1235 = \"Yes\", C1235<E1235), \"Yes\", \"No\"),\"No\")","v":"No"},{"$f":"IF(I1235 = \"Yes\", M1234/(C1235+CostBuy), IF(J1235 = \"Yes\", 0, K1234))","v":148184.62741931321},null,{"$f":"IF(I1235 = \"Yes\", M1234-(C1235+CostBuy)*K1235, IF(J1235=\"Yes\", M1234+(C1235-CostSell)*K1234, M1234+K1235*Rate))","v":74092.313709656606}]
[null,1972.11,115.1,108.81666666666666,108.675,null,"Yes",null,{"$f":"IF(BuyAllowed=\"Yes\",IF(AND(G1236 = \"No\", C1236>D1236), \"Yes\", \"No\"),\"No\")","v":"No"},{"$f":"IF(SellAllowed=\"Yes\",IF(AND(G1236 = \"Yes\", C1236<E1236), \"Yes\", \"No\"),\"No\")","v":"No"},{"$f":"IF(I1236 = \"Yes\", M1235/(C1236+CostBuy), IF(J1236 = \"Yes\", 0, K1235))","v":148184.62741931321},null,{"$f":"IF(I1236 = \"Yes\", M1235-(C1236+CostBuy)*K1236, IF(J1236=\"Yes\", M1235+(C1236-CostSell)*K1235, M1235+K1236*Rate))","v":81501.545080622265}]
[null,1972.12,117.5,110.05000000000001,109.60000000000001,null,"Yes",null,{"$f":"IF(BuyAllowed=\"Yes\",IF(AND(G1237 = \"No\", C1237>D1237), \"Yes\", \"No\"),\"No\")","v":"No"},{"$f":"IF(SellAllowed=\"Yes\",IF(AND(G1237 = \"Yes\", C1237<E1237), \"Yes\", \"No\"),\"No\")","v":"No"},{"$f":"IF(I1237 = \"Yes\", M1236/(C1237+CostBuy), IF(J1237 = \"Yes\", 0, K1236))","v":148184.62741931321},null,{"$f":"IF(I1237 = \"Yes\", M1236-(C1237+CostBuy)*K1237, IF(J1237=\"Yes\", M1236+(C1237-CostSell)*K1236, M1236+K1237*Rate))","v":88910.776451587924}]
[null,1973.01,118.4,111.63333333333334,110.6875,null,"Yes",null,{"$f":"IF(BuyAllowed=\"Yes\",IF(AND(G1238 = \"No\", C1238>D1238), \"Yes\", \"No\"),\"No\")","v":"No"},{"$f":"IF(SellAllowed=\"Yes\",IF(AND(G1238 = \"Yes\", C1238<E1238), \"Yes\", \"No\"),\"No\")","v":"No"},{"$f":"IF(I1238 = \"Yes\", M1237/(C1238+CostBuy), IF(J1238 = \"Yes\", 0, K1237))","v":148184.62741931321},null,{"$f":"IF(I1238 = \"Yes\", M1237-(C1238+CostBuy)*K1238, IF(J1238=\"Yes\", M1237+(C1238-CostSell)*K1237, M1237+K1238*Rate))","v":96320.007822553584}]
[null,1973.02,114.2,113.5,112.02500000000001,null,"Yes",null,{"$f":"IF(BuyAllowed=\"Yes\",IF(AND(G1239 = \"No\", C1239>D1239), \"Yes\", \"No\"),\"No\")","v":"No"},{"$f":"IF(SellAllowed=\"Yes\",IF(AND(G1239 = \"Yes\", C1239<E1239), \"Yes\", \"No\"),\"No\")","v":"No"},{"$f":"IF(I1239 = \"Yes\", M1238/(C1239+CostBuy), IF(J1239 = \"Yes\", 0, K1238))","v":148184.62741931321},null,{"$f":"IF(I1239 = \"Yes\", M1238-(C1239+CostBuy)*K1239, IF(J1239=\"Yes\", M1238+(C1239-CostSell)*K1238, M1238+K1239*Rate))","v":103729.23919351924}]
[null,1973.03,112.4,114.03333333333335,112.80000000000001,null,"Yes",null,{"$f":"IF(BuyAllowed=\"Yes\",IF(AND(G1240 = \"No\", C1240>D1240), \"Yes\", \"No\"),\"No\")","v":"No"},{"$f":"IF(SellAllowed=\"Yes\",IF(AND(G1240 = \"Yes\", C1240<E1240), \"Yes\", \"No\"),\"No\")","v":"Yes"},{"$f":"IF(I1240 = \"Yes\", M1239/(C1240+CostBuy), IF(J1240 = \"Yes\", 0, K1239))","v":0},null,{"$f":"IF(I1240 = \"Yes\", M1239-(C1240+CostBuy)*K1240, IF(J1240=\"Yes\", M1239+(C1240-CostSell)*K1239, M1239+K1240*Rate))","v":16750790.283479167}]
[null,1973.04,110.3,114.53333333333335,113.45,null,"No",null,{"$f":"IF(BuyAllowed=\"Yes\",IF(AND(G1241 = \"No\", C1241>D1241), \"Yes\", \"No\"),\"No\")","v":"No"},{"$f":"IF(SellAllowed=\"Yes\",IF(AND(G1241 = \"Yes\", C1241<E1241), \"Yes\", \"No\"),\"No\")","v":"No"},{"$f":"IF(I1241 = \"Yes\", M1240/(C1241+CostBuy), IF(J1241 = \"Yes\", 0, K1240))","v":0},null,{"$f":"IF(I1241 = \"Yes\", M1240-(C1241+CostBuy)*K1241, IF(J1241=\"Yes\", M1240+(C1241-CostSell)*K1240, M1240+K1241*Rate))","v":16750790.283479167}]
[null,1973.05,107.2,114.64999999999999,113.3625,null,"No",null,{"$f":"IF(BuyAllowed=\"Yes\",IF(AND(G1242 = \"No\", C1242>D1242), \"Yes\", \"No\"),\"No\")","v":"No"},{"$f":"IF(SellAllowed=\"Yes\",IF(AND(G1242 = \"Yes\", C1242<E1242), \"Yes\", \"No\"),\"No\")","v":"No"},{"$f":"IF(I1242 = \"Yes\", M1241/(C1242+CostBuy), IF(J1242 = \"Yes\", 0, K1241))","v":0},null,{"$f":"IF(I1242 = \"Yes\", M1241-(C1242+CostBuy)*K1242, IF(J1242=\"Yes\", M1241+(C1242-CostSell)*K1241, M1241+K1242*Rate))","v":16750790.283479167}]
[null,1973.06,104.8,{"$f":"AVERAGE(C1237:C1242)","v":113.33333333333333},{"$f":"AVERAGE(C1235:C1242)","v":113.08750000000001},null,"No",null,{"$f":"IF(BuyAllowed=\"Yes\",IF(AND(G1243 = \"No\", C1243>D1243), \"Yes\", \"No\"),\"No\")","v":"No"},{"$f":"IF(SellAllowed=\"Yes\",IF(AND(G1243 = \"Yes\", C1243<E1243), \"Yes\", \"No\"),\"No\")","v":"No"},{"$f":"IF(I1243 = \"Yes\", M1242/(C1243+CostBuy), IF(J1243 = \"Yes\", 0, K1242))","v":0},null,{"$f":"IF(I1243 = \"Yes\", M1242-(C1243+CostBuy)*K1243, IF(J1243=\"Yes\", M1242+(C1243-CostSell)*K1242, M1242+K1243*Rate))","v":16750790.283479167}]
[null,1973.07,105.8,111.21666666666665,112.4875,null,{"$f":"IF(I1243 = \"Yes\", \"Yes\", IF(J1243=\"Yes\", \"No\", G1243))","v":"No"},null,{"$f":"IF(BuyAllowed=\"Yes\",IF(AND(G1244 = \"No\", C1244>D1244), \"Yes\", \"No\"),\"No\")","v":"No"},{"$f":"IF(SellAllowed=\"Yes\",IF(AND(G1244 = \"Yes\", C1244<E1244), \"Yes\", \"No\"),\"No\")","v":"No"},{"$f":"IF(I1244 = \"Yes\", M1243/(C1244+CostBuy), IF(J1244 = \"Yes\", 0, K1243))","v":0},null,{"$f":"IF(I1244 = \"Yes\", M1243-(C1244+CostBuy)*K1244, IF(J1244=\"Yes\", M1243+(C1244-CostSell)*K1243, M1243+K1244*Rate))","v":16750790.283479167}]
[null,1973.08,103.8,109.11666666666666,111.32499999999999,null,"No",null,{"$f":"IF(BuyAllowed=\"Yes\",IF(AND(G1245 = \"No\", C1245>D1245), \"Yes\", \"No\"),\"No\")","v":"No"},{"$f":"IF(SellAllowed=\"Yes\",IF(AND(G1245 = \"Yes\", C1245<E1245), \"Yes\", \"No\"),\"No\")","v":"No"},{"$f":"IF(I1245 = \"Yes\", M1244/(C1245+CostBuy), IF(J1245 = \"Yes\", 0, K1244))","v":0},null,{"$f":"IF(I1245 = \"Yes\", M1244-(C1245+CostBuy)*K1245, IF(J1245=\"Yes\", M1244+(C1245-CostSell)*K1244, M1244+K1245*Rate))","v":16750790.283479167}]
[null,1973.09,105.6,107.38333333333333,109.61249999999998,null,"No",null,{"$f":"IF(BuyAllowed=\"Yes\",IF(AND(G1246 = \"No\", C1246>D1246), \"Yes\", \"No\"),\"No\")","v":"No"},{"$f":"IF(SellAllowed=\"Yes\",IF(AND(G1246 = \"Yes\", C1246<E1246), \"Yes\", \"No\"),\"No\")","v":"No"},{"$f":"IF(I1246 = \"Yes\", M1245/(C1246+CostBuy), IF(J1246 = \"Yes\", 0, K1245))","v":0},null,{"$f":"IF(I1246 = \"Yes\", M1245-(C1246+CostBuy)*K1246, IF(J1246=\"Yes\", M1245+(C1246-CostSell)*K1245, M1245+K1246*Rate))","v":16750790.283479167}]
[null,1973.1,109.8,106.25,108.01249999999999,null,"No",null,{"$f":"IF(BuyAllowed=\"Yes\",IF(AND(G1247 = \"No\", C1247>D1247), \"Yes\", \"No\"),\"No\")","v":"Yes"},{"$f":"IF(SellAllowed=\"Yes\",IF(AND(G1247 = \"Yes\", C1247<E1247), \"Yes\", \"No\"),\"No\")","v":"No"},{"$f":"IF(I1247 = \"Yes\", M1246/(C1247+CostBuy), IF(J1247 = \"Yes\", 0, K1246))","v":152515.61762249994},null,{"$f":"IF(I1247 = \"Yes\", M1246-(C1247+CostBuy)*K1247, IF(J1247=\"Yes\", M1246+(C1247-CostSell)*K1246, M1246+K1247*Rate))","v":0}]
[null,1973.11,102,106.16666666666667,107.46249999999999,null,"Yes",null,{"$f":"IF(BuyAllowed=\"Yes\",IF(AND(G1248 = \"No\", C1248>D1248), \"Yes\", \"No\"),\"No\")","v":"No"},{"$f":"IF(SellAllowed=\"Yes\",IF(AND(G1248 = \"Yes\", C1248<E1248), \"Yes\", \"No\"),\"No\")","v":"Yes"},{"$f":"IF(I1248 = \"Yes\", M1247/(C1248+CostBuy), IF(J1248 = \"Yes\", 0, K1247))","v":0},null,{"$f":"IF(I1248 = \"Yes\", M1247-(C1248+CostBuy)*K1248, IF(J1248=\"Yes\", M1247+(C1248-CostSell)*K1247, M1247+K1248*Rate))","v":15547442.060437644}]
[null,1973.12,94.78,105.3,106.16249999999999,null,"No",null,{"$f":"IF(BuyAllowed=\"Yes\",IF(AND(G1249 = \"No\", C1249>D1249), \"Yes\", \"No\"),\"No\")","v":"No"},{"$f":"IF(SellAllowed=\"Yes\",IF(AND(G1249 = \"Yes\", C1249<E1249), \"Yes\", \"No\"),\"No\")","v":"No"},{"$f":"IF(I1249 = \"Yes\", M1248/(C1249+CostBuy), IF(J1249 = \"Yes\", 0, K1248))","v":0},null,{"$f":"IF(I1249 = \"Yes\", M1248-(C1249+CostBuy)*K1249, IF(J1249=\"Yes\", M1248+(C1249-CostSell)*K1248, M1248+K1249*Rate))","v":15547442.060437644}]
[null,1974.01,96.11,103.63,104.2225,null,"No",null,{"$f":"IF(BuyAllowed=\"Yes\",IF(AND(G1250 = \"No\", C1250>D1250), \"Yes\", \"No\"),\"No\")","v":"No"},{"$f":"IF(SellAllowed=\"Yes\",IF(AND(G1250 = \"Yes\", C1250<E1250), \"Yes\", \"No\"),\"No\")","v":"No"},{"$f":"IF(I1250 = \"Yes\", M1249/(C1250+CostBuy), IF(J1250 = \"Yes\", 0, K1249))","v":0},null,{"$f":"IF(I1250 = \"Yes\", M1249-(C1250+CostBuy)*K1250, IF(J1250=\"Yes\", M1249+(C1250-CostSell)*K1249, M1249+K1250*Rate))","v":15547442.060437644}]
[null,1974.02,93.45,102.015,102.83624999999999,null,"No",null,{"$f":"IF(BuyAllowed=\"Yes\",IF(AND(G1251 = \"No\", C1251>D1251), \"Yes\", \"No\"),\"No\")","v":"No"},{"$f":"IF(SellAllowed=\"Yes\",IF(AND(G1251 = \"Yes\", C1251<E1251), \"Yes\", \"No\"),\"No\")","v":"No"},{"$f":"IF(I1251 = \"Yes\", M1250/(C1251+CostBuy), IF(J1251 = \"Yes\", 0, K1250))","v":0},null,{"$f":"IF(I1251 = \"Yes\", M1250-(C1251+CostBuy)*K1251, IF(J1251=\"Yes\", M1250+(C1251-CostSell)*K1250, M1250+K1251*Rate))","v":15547442.060437644}]
[null,1974.03,97.44,100.29,101.4175,null,"No",null,{"$f":"IF(BuyAllowed=\"Yes\",IF(AND(G1252 = \"No\", C1252>D1252), \"Yes\", \"No\"),\"No\")","v":"No"},{"$f":"IF(SellAllowed=\"Yes\",IF(AND(G1252 = \"Yes\", C1252<E1252), \"Yes\", \"No\"),\"No\")","v":"No"},{"$f":"IF(I1252 = \"Yes\", M1251/(C1252+CostBuy), IF(J1252 = \"Yes\", 0, K1251))","v":0},null,{"$f":"IF(I1252 = \"Yes\", M1251-(C1252+CostBuy)*K1252, IF(J1252=\"Yes\", M1251+(C1252-CostSell)*K1251, M1251+K1252*Rate))","v":15547442.060437644}]
[null,1974.04,92.46,98.93,100.3725,null,"No",null,{"$f":"IF(BuyAllowed=\"Yes\",IF(AND(G1253 = \"No\", C1253>D1253), \"Yes\", \"No\"),\"No\")","v":"No"},{"$f":"IF(SellAllowed=\"Yes\",IF(AND(G1253 = \"Yes\", C1253<E1253), \"Yes\", \"No\"),\"No\")","v":"No"},{"$f":"IF(I1253 = \"Yes\", M1252/(C1253+CostBuy), IF(J1253 = \"Yes\", 0, K1252))","v":0},null,{"$f":"IF(I1253 = \"Yes\", M1252-(C1253+CostBuy)*K1253, IF(J1253=\"Yes\", M1252+(C1253-CostSell)*K1252, M1252+K1253*Rate))","v":15547442.060437644}]
[null,1974.05,89.67,96.04,98.955000000000013,null,"No",null,{"$f":"IF(BuyAllowed=\"Yes\",IF(AND(G1254 = \"No\", C1254>D1254), \"Yes\", \"No\"),\"No\")","v":"No"},{"$f":"IF(SellAllowed=\"Yes\",IF(AND(G1254 = \"Yes\", C1254<E1254), \"Yes\", \"No\"),\"No\")","v":"No"},{"$f":"IF(I1254 = \"Yes\", M1253/(C1254+CostBuy), IF(J1254 = \"Yes\", 0, K1253))","v":0},null,{"$f":"IF(I1254 = \"Yes\", M1253-(C1254+CostBuy)*K1254, IF(J1254=\"Yes\", M1253+(C1254-CostSell)*K1253, M1253+K1254*Rate))","v":15547442.060437644}]
[null,1974.06,89.79,93.984999999999999,96.963750000000005,null,"No",null,{"$f":"IF(BuyAllowed=\"Yes\",IF(AND(G1255 = \"No\", C1255>D1255), \"Yes\", \"No\"),\"No\")","v":"No"},{"$f":"IF(SellAllowed=\"Yes\",IF(AND(G1255 = \"Yes\", C1255<E1255), \"Yes\", \"No\"),\"No\")","v":"No"},{"$f":"IF(I1255 = \"Yes\", M1254/(C1255+CostBuy), IF(J1255 = \"Yes\", 0, K1254))","v":0},null,{"$f":"IF(I1255 = \"Yes\", M1254-(C1255+CostBuy)*K1255, IF(J1255=\"Yes\", M1254+(C1255-CostSell)*K1254, M1254+K1255*Rate))","v":15547442.060437644}]
[null,1974.07,79.31,93.153333333333322,94.462499999999991,null,"No",null,{"$f":"IF(BuyAllowed=\"Yes\",IF(AND(G1256 = \"No\", C1256>D1256), \"Yes\", \"No\"),\"No\")","v":"No"},{"$f":"IF(SellAllowed=\"Yes\",IF(AND(G1256 = \"Yes\", C1256<E1256), \"Yes\", \"No\"),\"No\")","v":"No"},{"$f":"IF(I1256 = \"Yes\", M1255/(C1256+CostBuy), IF(J1256 = \"Yes\", 0, K1255))","v":0},null,{"$f":"IF(I1256 = \"Yes\", M1255-(C1256+CostBuy)*K1256, IF(J1256=\"Yes\", M1255+(C1256-CostSell)*K1255, M1255+K1256*Rate))","v":15547442.060437644}]
[null,1974.08,76.03,90.353333333333339,91.626249999999999,null,"No",null,{"$f":"IF(BuyAllowed=\"Yes\",IF(AND(G1257 = \"No\", C1257>D1257), \"Yes\", \"No\"),\"No\")","v":"No"},{"$f":"IF(SellAllowed=\"Yes\",IF(AND(G1257 = \"Yes\", C1257<E1257), \"Yes\", \"No\"),\"No\")","v":"No"},{"$f":"IF(I1257 = \"Yes\", M1256/(C1257+CostBuy), IF(J1257 = \"Yes\", 0, K1256))","v":0},null,{"$f":"IF(I1257 = \"Yes\", M1256-(C1257+CostBuy)*K1257, IF(J1257=\"Yes\", M1256+(C1257-CostSell)*K1256, M1256+K1257*Rate))","v":15547442.060437644}]
[null,1974.09,68.12,87.45,89.282499999999999,null,"No",null,{"$f":"IF(BuyAllowed=\"Yes\",IF(AND(G1258 = \"No\", C1258>D1258), \"Yes\", \"No\"),\"No\")","v":"No"},{"$f":"IF(SellAllowed=\"Yes\",IF(AND(G1258 = \"Yes\", C1258<E1258), \"Yes\", \"No\"),\"No\")","v":"No"},{"$f":"IF(I1258 = \"Yes\", M1257/(C1258+CostBuy), IF(J1258 = \"Yes\", 0, K1257))","v":0},null,{"$f":"IF(I1258 = \"Yes\", M1257-(C1258+CostBuy)*K1258, IF(J1258=\"Yes\", M1257+(C1258-CostSell)*K1257, M1257+K1258*Rate))","v":15547442.060437644}]
[null,1974.1,69.44,82.563333333333333,85.783749999999998,null,"No",null,{"$f":"IF(BuyAllowed=\"Yes\",IF(AND(G1259 = \"No\", C1259>D1259), \"Yes\", \"No\"),\"No\")","v":"No"},{"$f":"IF(SellAllowed=\"Yes\",IF(AND(G1259 = \"Yes\", C1259<E1259), \"Yes\", \"No\"),\"No\")","v":"No"},{"$f":"IF(I1259 = \"Yes\", M1258/(C1259+CostBuy), IF(J1259 = \"Yes\", 0, K1258))","v":0},null,{"$f":"IF(I1259 = \"Yes\", M1258-(C1259+CostBuy)*K1259, IF(J1259=\"Yes\", M1258+(C1259-CostSell)*K1258, M1258+K1259*Rate))","v":15547442.060437644}]
[null,1974.11,71.739999999999995,78.726666666666659,82.782499999999999,null,"No",null,{"$f":"IF(BuyAllowed=\"Yes\",IF(AND(G1260 = \"No\", C1260>D1260), \"Yes\", \"No\"),\"No\")","v":"No"},{"$f":"IF(SellAllowed=\"Yes\",IF(AND(G1260 = \"Yes\", C1260<E1260), \"Yes\", \"No\"),\"No\")","v":"No"},{"$f":"IF(I1260 = \"Yes\", M1259/(C1260+CostBuy), IF(J1260 = \"Yes\", 0, K1259))","v":0},null,{"$f":"IF(I1260 = \"Yes\", M1259-(C1260+CostBuy)*K1260, IF(J1260=\"Yes\", M1259+(C1260-CostSell)*K1259, M1259+K1260*Rate))","v":15547442.060437644}]
[null,1974.12,67.069999999999993,75.73833333333333,79.569999999999993,null,"No",null,{"$f":"IF(BuyAllowed=\"Yes\",IF(AND(G1261 = \"No\", C1261>D1261), \"Yes\", \"No\"),\"No\")","v":"No"},{"$f":"IF(SellAllowed=\"Yes\",IF(AND(G1261 = \"Yes\", C1261<E1261), \"Yes\", \"No\"),\"No\")","v":"No"},{"$f":"IF(I1261 = \"Yes\", M1260/(C1261+CostBuy), IF(J1261 = \"Yes\", 0, K1260))","v":0},null,{"$f":"IF(I1261 = \"Yes\", M1260-(C1261+CostBuy)*K1261, IF(J1261=\"Yes\", M1260+(C1261-CostSell)*K1260, M1260+K1261*Rate))","v":15547442.060437644}]
[null,1975.01,72.56,71.951666666666668,76.396249999999981,null,"No",null,{"$f":"IF(BuyAllowed=\"Yes\",IF(AND(G1262 = \"No\", C1262>D1262), \"Yes\", \"No\"),\"No\")","v":"Yes"},{"$f":"IF(SellAllowed=\"Yes\",IF(AND(G1262 = \"Yes\", C1262<E1262), \"Yes\", \"No\"),\"No\")","v":"No"},{"$f":"IF(I1262 = \"Yes\", M1261/(C1262+CostBuy), IF(J1262 = \"Yes\", 0, K1261))","v":214181.59609364436},null,{"$f":"IF(I1262 = \"Yes\", M1261-(C1262+CostBuy)*K1262, IF(J1262=\"Yes\", M1261+(C1262-CostSell)*K1261, M1261+K1262*Rate))","v":0}]
[null,1975.02,80.099999999999994,70.826666666666668,74.257499999999993,null,"Yes",null,{"$f":"IF(BuyAllowed=\"Yes\",IF(AND(G1263 = \"No\", C1263>D1263), \"Yes\", \"No\"),\"No\")","v":"No"},{"$f":"IF(SellAllowed=\"Yes\",IF(AND(G1263 = \"Yes\", C1263<E1263), \"Yes\", \"No\"),\"No\")","v":"No"},{"$f":"IF(I1263 = \"Yes\", M1262/(C1263+CostBuy), IF(J1263 = \"Yes\", 0, K1262))","v":214181.59609364436},null,{"$f":"IF(I1263 = \"Yes\", M1262-(C1263+CostBuy)*K1263, IF(J1263=\"Yes\", M1262+(C1263-CostSell)*K1262, M1262+K1263*Rate))","v":10709.079804682218}]
[null,1975.03,83.78,71.504999999999995,73.046250000000001,null,"Yes",null,{"$f":"IF(BuyAllowed=\"Yes\",IF(AND(G1264 = \"No\", C1264>D1264), \"Yes\", \"No\"),\"No\")","v":"No"},{"$f":"IF(SellAllowed=\"Yes\",IF(AND(G1264 = \"Yes\", C1264<E1264), \"Yes\", \"No\"),\"No\")","v":"No"},{"$f":"IF(I1264 = \"Yes\", M1263/(C1264+CostBuy), IF(J1264 = \"Yes\", 0, K1263))","v":214181.59609364436},null,{"$f":"IF(I1264 = \"Yes\", M1263-(C1264+CostBuy)*K1264, IF(J1264=\"Yes\", M1263+(C1264-CostSell)*K1263, M1263+K1264*Rate))","v":21418.159609364437}]
[null,1975.04,84.72,74.114999999999995,73.60499999999999,null,"Yes",null,{"$f":"IF(BuyAllowed=\"Yes\",IF(AND(G1265 = \"No\", C1265>D1265), \"Yes\", \"No\"),\"No\")","v":"No"},{"$f":"IF(SellAllowed=\"Yes\",IF(AND(G1265 = \"Yes\", C1265<E1265), \"Yes\", \"No\"),\"No\")","v":"No"},{"$f":"IF(I1265 = \"Yes\", M1264/(C1265+CostBuy), IF(J1265 = \"Yes\", 0, K1264))","v":214181.59609364436},null,{"$f":"IF(I1265 = \"Yes\", M1264-(C1265+CostBuy)*K1265, IF(J1265=\"Yes\", M1264+(C1265-CostSell)*K1264, M1264+K1265*Rate))","v":32127.239414046657}]
[null,1975.05,90.1,76.661666666666676,74.691249999999997,null,"Yes",null,{"$f":"IF(BuyAllowed=\"Yes\",IF(AND(G1266 = \"No\", C1266>D1266), \"Yes\", \"No\"),\"No\")","v":"No"},{"$f":"IF(SellAllowed=\"Yes\",IF(AND(G1266 = \"Yes\", C1266<E1266), \"Yes\", \"No\"),\"No\")","v":"No"},{"$f":"IF(I1266 = \"Yes\", M1265/(C1266+CostBuy), IF(J1266 = \"Yes\", 0, K1265))","v":214181.59609364436},null,{"$f":"IF(I1266 = \"Yes\", M1265-(C1266+CostBuy)*K1266, IF(J1266=\"Yes\", M1265+(C1266-CostSell)*K1265, M1265+K1266*Rate))","v":42836.319218728873}]
[null,1975.06,92.4,79.721666666666678,77.438749999999999,null,"Yes",null,{"$f":"IF(BuyAllowed=\"Yes\",IF(AND(G1267 = \"No\", C1267>D1267), \"Yes\", \"No\"),\"No\")","v":"No"},{"$f":"IF(SellAllowed=\"Yes\",IF(AND(G1267 = \"Yes\", C1267<E1267), \"Yes\", \"No\"),\"No\")","v":"No"},{"$f":"IF(I1267 = \"Yes\", M1266/(C1267+CostBuy), IF(J1267 = \"Yes\", 0, K1266))","v":214181.59609364436},null,{"$f":"IF(I1267 = \"Yes\", M1266-(C1267+CostBuy)*K1267, IF(J1267=\"Yes\", M1266+(C1267-CostSell)*K1266, M1266+K1267*Rate))","v":53545.39902341109}]
[null,1975.07,92.49,83.943333333333328,80.308750000000003,null,"Yes",null,{"$f":"IF(BuyAllowed=\"Yes\",IF(AND(G1268 = \"No\", C1268>D1268), \"Yes\", \"No\"),\"No\")","v":"No"},{"$f":"IF(SellAllowed=\"Yes\",IF(AND(G1268 = \"Yes\", C1268<E1268), \"Yes\", \"No\"),\"No\")","v":"No"},{"$f":"IF(I1268 = \"Yes\", M1267/(C1268+CostBuy), IF(J1268 = \"Yes\", 0, K1267))","v":214181.59609364436},null,{"$f":"IF(I1268 = \"Yes\", M1267-(C1268+CostBuy)*K1268, IF(J1268=\"Yes\", M1267+(C1268-CostSell)*K1267, M1267+K1268*Rate))","v":64254.478828093306}]
[null,1975.08,85.71,87.265000000000001,82.902500000000003,null,"Yes",null,{"$f":"IF(BuyAllowed=\"Yes\",IF(AND(G1269 = \"No\", C1269>D1269), \"Yes\", \"No\"),\"No\")","v":"No"},{"$f":"IF(SellAllowed=\"Yes\",IF(AND(G1269 = \"Yes\", C1269<E1269), \"Yes\", \"No\"),\"No\")","v":"No"},{"$f":"IF(I1269 = \"Yes\", M1268/(C1269+CostBuy), IF(J1269 = \"Yes\", 0, K1268))","v":214181.59609364436},null,{"$f":"IF(I1269 = \"Yes\", M1268-(C1269+CostBuy)*K1269, IF(J1269=\"Yes\", M1268+(C1269-CostSell)*K1268, M1268+K1269*Rate))","v":74963.55863277553}]
[null,1975.09,84.67,88.2,85.232500000000002,null,"Yes",null,{"$f":"IF(BuyAllowed=\"Yes\",IF(AND(G1270 = \"No\", C1270>D1270), \"Yes\", \"No\"),\"No\")","v":"No"},{"$f":"IF(SellAllowed=\"Yes\",IF(AND(G1270 = \"Yes\", C1270<E1270), \"Yes\", \"No\"),\"No\")","v":"Yes"},{"$f":"IF(I1270 = \"Yes\", M1269/(C1270+CostBuy), IF(J1270 = \"Yes\", 0, K1269))","v":0},null,{"$f":"IF(I1270 = \"Yes\", M1269-(C1270+CostBuy)*K1270, IF(J1270=\"Yes\", M1269+(C1270-CostSell)*K1269, M1269+K1270*Rate))","v":18196868.404116027}]
[null,1975.1,88.57,88.348333333333343,86.746250000000003,null,"No",null,{"$f":"IF(BuyAllowed=\"Yes\",IF(AND(G1271 = \"No\", C1271>D1271), \"Yes\", \"No\"),\"No\")","v":"Yes"},{"$f":"IF(SellAllowed=\"Yes\",IF(AND(G1271 = \"Yes\", C1271<E1271), \"Yes\", \"No\"),\"No\")","v":"No"},{"$f":"IF(I1271 = \"Yes\", M1270/(C1271+CostBuy), IF(J1271 = \"Yes\", 0, K1270))","v":205382.26189747211},null,{"$f":"IF(I1271 = \"Yes\", M1270-(C1271+CostBuy)*K1271, IF(J1271=\"Yes\", M1270+(C1271-CostSell)*K1270, M1270+K1271*Rate))","v":0}]
[null,1975.11,90.07,88.990000000000009,87.805000000000007,null,"Yes",null,{"$f":"IF(BuyAllowed=\"Yes\",IF(AND(G1272 = \"No\", C1272>D1272), \"Yes\", \"No\"),\"No\")","v":"No"},{"$f":"IF(SellAllowed=\"Yes\",IF(AND(G1272 = \"Yes\", C1272<E1272), \"Yes\", \"No\"),\"No\")","v":"No"},{"$f":"IF(I1272 = \"Yes\", M1271/(C1272+CostBuy), IF(J1272 = \"Yes\", 0, K1271))","v":205382.26189747211},null,{"$f":"IF(I1272 = \"Yes\", M1271-(C1272+CostBuy)*K1272, IF(J1272=\"Yes\", M1271+(C1272-CostSell)*K1271, M1271+K1272*Rate))","v":10269.113094873606}]
[null,1975.12,88.7,88.984999999999999,88.591250000000002,null,"Yes",null,{"$f":"IF(BuyAllowed=\"Yes\",IF(AND(G1273 = \"No\", C1273>D1273), \"Yes\", \"No\"),\"No\")","v":"No"},{"$f":"IF(SellAllowed=\"Yes\",IF(AND(G1273 = \"Yes\", C1273<E1273), \"Yes\", \"No\"),\"No\")","v":"No"},{"$f":"IF(I1273 = \"Yes\", M1272/(C1273+CostBuy), IF(J1273 = \"Yes\", 0, K1272))","v":205382.26189747211},null,{"$f":"IF(I1273 = \"Yes\", M1272-(C1273+CostBuy)*K1273, IF(J1273=\"Yes\", M1272+(C1273-CostSell)*K1272, M1272+K1273*Rate))","v":20538.226189747213}]
[null,1976.01,96.86,88.368333333333339,89.088750000000005,null,"Yes",null,{"$f":"IF(BuyAllowed=\"Yes\",IF(AND(G1274 = \"No\", C1274>D1274), \"Yes\", \"No\"),\"No\")","v":"No"},{"$f":"IF(SellAllowed=\"Yes\",IF(AND(G1274 = \"Yes\", C1274<E1274), \"Yes\", \"No\"),\"No\")","v":"No"},{"$f":"IF(I1274 = \"Yes\", M1273/(C1274+CostBuy), IF(J1274 = \"Yes\", 0, K1273))","v":205382.26189747211},null,{"$f":"IF(I1274 = \"Yes\", M1273-(C1274+CostBuy)*K1274, IF(J1274=\"Yes\", M1273+(C1274-CostSell)*K1273, M1273+K1274*Rate))","v":30807.339284620819}]
[null,1976.02,100.6,89.09666666666665,89.933750000000003,null,"Yes",null,{"$f":"IF(BuyAllowed=\"Yes\",IF(AND(G1275 = \"No\", C1275>D1275), \"Yes\", \"No\"),\"No\")","v":"No"},{"$f":"IF(SellAllowed=\"Yes\",IF(AND(G1275 = \"Yes\", C1275<E1275), \"Yes\", \"No\"),\"No\")","v":"No"},{"$f":"IF(I1275 = \"Yes\", M1274/(C1275+CostBuy), IF(J1275 = \"Yes\", 0, K1274))","v":205382.26189747211},null,{"$f":"IF(I1275 = \"Yes\", M1274-(C1275+CostBuy)*K1275, IF(J1275=\"Yes\", M1274+(C1275-CostSell)*K1274, M1274+K1275*Rate))","v":41076.452379494425}]
[null,1976.03,101.1,91.578333333333333,90.958750000000009,null,"Yes",null,{"$f":"IF(BuyAllowed=\"Yes\",IF(AND(G1276 = \"No\", C1276>D1276), \"Yes\", \"No\"),\"No\")","v":"No"},{"$f":"IF(SellAllowed=\"Yes\",IF(AND(G1276 = \"Yes\", C1276<E1276), \"Yes\", \"No\"),\"No\")","v":"No"},{"$f":"IF(I1276 = \"Yes\", M1275/(C1276+CostBuy), IF(J1276 = \"Yes\", 0, K1275))","v":205382.26189747211},null,{"$f":"IF(I1276 = \"Yes\", M1275-(C1276+CostBuy)*K1276, IF(J1276=\"Yes\", M1275+(C1276-CostSell)*K1275, M1275+K1276*Rate))","v":51345.565474368035}]
[null,1976.04,101.9,94.316666666666663,92.034999999999997,null,"Yes",null,{"$f":"IF(BuyAllowed=\"Yes\",IF(AND(G1277 = \"No\", C1277>D1277), \"Yes\", \"No\"),\"No\")","v":"No"},{"$f":"IF(SellAllowed=\"Yes\",IF(AND(G1277 = \"Yes\", C1277<E1277), \"Yes\", \"No\"),\"No\")","v":"No"},{"$f":"IF(I1277 = \"Yes\", M1276/(C1277+CostBuy), IF(J1277 = \"Yes\", 0, K1276))","v":205382.26189747211},null,{"$f":"IF(I1277 = \"Yes\", M1276-(C1277+CostBuy)*K1277, IF(J1277=\"Yes\", M1276+(C1277-CostSell)*K1276, M1276+K1277*Rate))","v":61614.678569241645}]
[null,1976.05,101.2,96.538333333333341,94.058750000000003,null,"Yes",null,{"$f":"IF(BuyAllowed=\"Yes\",IF(AND(G1278 = \"No\", C1278>D1278), \"Yes\", \"No\"),\"No\")","v":"No"},{"$f":"IF(SellAllowed=\"Yes\",IF(AND(G1278 = \"Yes\", C1278<E1278), \"Yes\", \"No\"),\"No\")","v":"No"},{"$f":"IF(I1278 = \"Yes\", M1277/(C1278+CostBuy), IF(J1278 = \"Yes\", 0, K1277))","v":205382.26189747211},null,{"$f":"IF(I1278 = \"Yes\", M1277-(C1278+CostBuy)*K1278, IF(J1278=\"Yes\", M1277+(C1278-CostSell)*K1277, M1277+K1278*Rate))","v":71883.791664115255}]
[null,1976.06,101.8,98.393333333333331,96.125,null,"Yes",null,{"$f":"IF(BuyAllowed=\"Yes\",IF(AND(G1279 = \"No\", C1279>D1279), \"Yes\", \"No\"),\"No\")","v":"No"},{"$f":"IF(SellAllowed=\"Yes\",IF(AND(G1279 = \"Yes\", C1279<E1279), \"Yes\", \"No\"),\"No\")","v":"No"},{"$f":"IF(I1279 = \"Yes\", M1278/(C1279+CostBuy), IF(J1279 = \"Yes\", 0, K1278))","v":205382.26189747211},null,{"$f":"IF(I1279 = \"Yes\", M1278-(C1279+CostBuy)*K1279, IF(J1279=\"Yes\", M1278+(C1279-CostSell)*K1278, M1278+K1279*Rate))","v":82152.904758988865}]
[null,1976.07,104.2,100.57666666666665,97.778750000000002,null,"Yes",null,{"$f":"IF(BuyAllowed=\"Yes\",IF(AND(G1280 = \"No\", C1280>D1280), \"Yes\", \"No\"),\"No\")","v":"No"},{"$f":"IF(SellAllowed=\"Yes\",IF(AND(G1280 = \"Yes\", C1280<E1280), \"Yes\", \"No\"),\"No\")","v":"No"},{"$f":"IF(I1280 = \"Yes\", M1279/(C1280+CostBuy), IF(J1280 = \"Yes\", 0, K1279))","v":205382.26189747211},null,{"$f":"IF(I1280 = \"Yes\", M1279-(C1280+CostBuy)*K1280, IF(J1280=\"Yes\", M1279+(C1280-CostSell)*K1279, M1279+K1280*Rate))","v":92422.017853862475}]
[null,1976.08,103.3,101.80000000000001,99.545000000000002,null,"Yes",null,{"$f":"IF(BuyAllowed=\"Yes\",IF(AND(G1281 = \"No\", C1281>D1281), \"Yes\", \"No\"),\"No\")","v":"No"},{"$f":"IF(SellAllowed=\"Yes\",IF(AND(G1281 = \"Yes\", C1281<E1281), \"Yes\", \"No\"),\"No\")","v":"No"},{"$f":"IF(I1281 = \"Yes\", M1280/(C1281+CostBuy), IF(J1281 = \"Yes\", 0, K1280))","v":205382.26189747211},null,{"$f":"IF(I1281 = \"Yes\", M1280-(C1281+CostBuy)*K1281, IF(J1281=\"Yes\", M1280+(C1281-CostSell)*K1280, M1280+K1281*Rate))","v":102691.13094873608}]
[null,1976.09,105.5,102.25,101.36999999999999,null,"Yes",null,{"$f":"IF(BuyAllowed=\"Yes\",IF(AND(G1282 = \"No\", C1282>D1282), \"Yes\", \"No\"),\"No\")","v":"No"},{"$f":"IF(SellAllowed=\"Yes\",IF(AND(G1282 = \"Yes\", C1282<E1282), \"Yes\", \"No\"),\"No\")","v":"No"},{"$f":"IF(I1282 = \"Yes\", M1281/(C1282+CostBuy), IF(J1282 = \"Yes\", 0, K1281))","v":205382.26189747211},null,{"$f":"IF(I1282 = \"Yes\", M1281-(C1282+CostBuy)*K1282, IF(J1282=\"Yes\", M1281+(C1282-CostSell)*K1281, M1281+K1282*Rate))","v":112960.24404360969}]
[null,1976.1,101.9,102.98333333333333,102.45,null,"Yes",null,{"$f":"IF(BuyAllowed=\"Yes\",IF(AND(G1283 = \"No\", C1283>D1283), \"Yes\", \"No\"),\"No\")","v":"No"},{"$f":"IF(SellAllowed=\"Yes\",IF(AND(G1283 = \"Yes\", C1283<E1283), \"Yes\", \"No\"),\"No\")","v":"Yes"},{"$f":"IF(I1283 = \"Yes\", M1282/(C1283+CostBuy), IF(J1283 = \"Yes\", 0, K1282))","v":0},null,{"$f":"IF(I1283 = \"Yes\", M1282-(C1283+CostBuy)*K1283, IF(J1283=\"Yes\", M1282+(C1283-CostSell)*K1282, M1282+K1283*Rate))","v":21029089.795682173}]
[null,1976.11,101.2,102.98333333333333,102.6125,null,"No",null,{"$f":"IF(BuyAllowed=\"Yes\",IF(AND(G1284 = \"No\", C1284>D1284), \"Yes\", \"No\"),\"No\")","v":"No"},{"$f":"IF(SellAllowed=\"Yes\",IF(AND(G1284 = \"Yes\", C1284<E1284), \"Yes\", \"No\"),\"No\")","v":"No"},{"$f":"IF(I1284 = \"Yes\", M1283/(C1284+CostBuy), IF(J1284 = \"Yes\", 0, K1283))","v":0},null,{"$f":"IF(I1284 = \"Yes\", M1283-(C1284+CostBuy)*K1284, IF(J1284=\"Yes\", M1283+(C1284-CostSell)*K1283, M1283+K1284*Rate))","v":21029089.795682173}]
[null,1976.12,104.7,102.98333333333335,102.625,null,"No",null,{"$f":"IF(BuyAllowed=\"Yes\",IF(AND(G1285 = \"No\", C1285>D1285), \"Yes\", \"No\"),\"No\")","v":"Yes"},{"$f":"IF(SellAllowed=\"Yes\",IF(AND(G1285 = \"Yes\", C1285<E1285), \"Yes\", \"No\"),\"No\")","v":"No"},{"$f":"IF(I1285 = \"Yes\", M1284/(C1285+CostBuy), IF(J1285 = \"Yes\", 0, K1284))","v":200793.37148555496},null,{"$f":"IF(I1285 = \"Yes\", M1284-(C1285+CostBuy)*K1285, IF(J1285=\"Yes\", M1284+(C1285-CostSell)*K1284, M1284+K1285*Rate))","v":0}]
[null,1977.01,103.8,103.46666666666668,102.97500000000001,null,"Yes",null,{"$f":"IF(BuyAllowed=\"Yes\",IF(AND(G1286 = \"No\", C1286>D1286), \"Yes\", \"No\"),\"No\")","v":"No"},{"$f":"IF(SellAllowed=\"Yes\",IF(AND(G1286 = \"Yes\", C1286<E1286), \"Yes\", \"No\"),\"No\")","v":"No"},{"$f":"IF(I1286 = \"Yes\", M1285/(C1286+CostBuy), IF(J1286 = \"Yes\", 0, K1285))","v":200793.37148555496},null,{"$f":"IF(I1286 = \"Yes\", M1285-(C1286+CostBuy)*K1286, IF(J1286=\"Yes\", M1285+(C1286-CostSell)*K1285, M1285+K1286*Rate))","v":10039.668574277748}]
[null,1977.02,101,103.39999999999999,103.30000000000001,null,"Yes",null,{"$f":"IF(BuyAllowed=\"Yes\",IF(AND(G1287 = \"No\", C1287>D1287), \"Yes\", \"No\"),\"No\")","v":"No"},{"$f":"IF(SellAllowed=\"Yes\",IF(AND(G1287 = \"Yes\", C1287<E1287), \"Yes\", \"No\"),\"No\")","v":"Yes"},{"$f":"IF(I1287 = \"Yes\", M1286/(C1287+CostBuy), IF(J1287 = \"Yes\", 0, K1286))","v":0},null,{"$f":"IF(I1287 = \"Yes\", M1286-(C1287+CostBuy)*K1287, IF(J1287=\"Yes\", M1286+(C1287-CostSell)*K1286, M1286+K1287*Rate))","v":20278122.586326193}]
[null,1977.03,100.6,103.01666666666667,103.2,null,"No",null,{"$f":"IF(BuyAllowed=\"Yes\",IF(AND(G1288 = \"No\", C1288>D1288), \"Yes\", \"No\"),\"No\")","v":"No"},{"$f":"IF(SellAllowed=\"Yes\",IF(AND(G1288 = \"Yes\", C1288<E1288), \"Yes\", \"No\"),\"No\")","v":"No"},{"$f":"IF(I1288 = \"Yes\", M1287/(C1288+CostBuy), IF(J1288 = \"Yes\", 0, K1287))","v":0},null,{"$f":"IF(I1288 = \"Yes\", M1287-(C1288+CostBuy)*K1288, IF(J1288=\"Yes\", M1287+(C1288-CostSell)*K1287, M1287+K1288*Rate))","v":20278122.586326193}]
[null,1977.04,99.05,102.2,102.75,null,"No",null,{"$f":"IF(BuyAllowed=\"Yes\",IF(AND(G1289 = \"No\", C1289>D1289), \"Yes\", \"No\"),\"No\")","v":"No"},{"$f":"IF(SellAllowed=\"Yes\",IF(AND(G1289 = \"Yes\", C1289<E1289), \"Yes\", \"No\"),\"No\")","v":"No"},{"$f":"IF(I1289 = \"Yes\", M1288/(C1289+CostBuy), IF(J1289 = \"Yes\", 0, K1288))","v":0},null,{"$f":"IF(I1289 = \"Yes\", M1288-(C1289+CostBuy)*K1289, IF(J1289=\"Yes\", M1288+(C1289-CostSell)*K1288, M1288+K1289*Rate))","v":20278122.586326193}]
[null,1977.05,98.76,101.72499999999998,102.21875,null,"No",null,{"$f":"IF(BuyAllowed=\"Yes\",IF(AND(G1290 = \"No\", C1290>D1290), \"Yes\", \"No\"),\"No\")","v":"No"},{"$f":"IF(SellAllowed=\"Yes\",IF(AND(G1290 = \"Yes\", C1290<E1290), \"Yes\", \"No\"),\"No\")","v":"No"},{"$f":"IF(I1290 = \"Yes\", M1289/(C1290+CostBuy), IF(J1290 = \"Yes\", 0, K1289))","v":0},null,{"$f":"IF(I1290 = \"Yes\", M1289-(C1290+CostBuy)*K1290, IF(J1290=\"Yes\", M1289+(C1290-CostSell)*K1289, M1289+K1290*Rate))","v":20278122.586326193}]
[null,1977.06,99.29,101.31833333333334,101.37625,null,"No",null,{"$f":"IF(BuyAllowed=\"Yes\",IF(AND(G1291 = \"No\", C1291>D1291), \"Yes\", \"No\"),\"No\")","v":"No"},{"$f":"IF(SellAllowed=\"Yes\",IF(AND(G1291 = \"Yes\", C1291<E1291), \"Yes\", \"No\"),\"No\")","v":"No"},{"$f":"IF(I1291 = \"Yes\", M1290/(C1291+CostBuy), IF(J1291 = \"Yes\", 0, K1290))","v":0},null,{"$f":"IF(I1291 = \"Yes\", M1290-(C1291+CostBuy)*K1291, IF(J1291=\"Yes\", M1290+(C1291-CostSell)*K1290, M1290+K1291*Rate))","v":20278122.586326193}]
[null,1977.07,100.2,100.41666666666667,101.04999999999998,null,"No",null,{"$f":"IF(BuyAllowed=\"Yes\",IF(AND(G1292 = \"No\", C1292>D1292), \"Yes\", \"No\"),\"No\")","v":"No"},{"$f":"IF(SellAllowed=\"Yes\",IF(AND(G1292 = \"Yes\", C1292<E1292), \"Yes\", \"No\"),\"No\")","v":"No"},{"$f":"IF(I1292 = \"Yes\", M1291/(C1292+CostBuy), IF(J1292 = \"Yes\", 0, K1291))","v":0},null,{"$f":"IF(I1292 = \"Yes\", M1291-(C1292+CostBuy)*K1292, IF(J1292=\"Yes\", M1291+(C1292-CostSell)*K1291, M1291+K1292*Rate))","v":20278122.586326193}]
[null,1977.08,97.75,99.816666666666663,100.92500000000001,null,"No",null,{"$f":"IF(BuyAllowed=\"Yes\",IF(AND(G1293 = \"No\", C1293>D1293), \"Yes\", \"No\"),\"No\")","v":"No"},{"$f":"IF(SellAllowed=\"Yes\",IF(AND(G1293 = \"Yes\", C1293<E1293), \"Yes\", \"No\"),\"No\")","v":"No"},{"$f":"IF(I1293 = \"Yes\", M1292/(C1293+CostBuy), IF(J1293 = \"Yes\", 0, K1292))","v":0},null,{"$f":"IF(I1293 = \"Yes\", M1292-(C1293+CostBuy)*K1293, IF(J1293=\"Yes\", M1292+(C1293-CostSell)*K1292, M1292+K1293*Rate))","v":20278122.586326193}]
[null,1977.09,96.23,99.274999999999991,100.05625000000001,null,"No",null,{"$f":"IF(BuyAllowed=\"Yes\",IF(AND(G1294 = \"No\", C1294>D1294), \"Yes\", \"No\"),\"No\")","v":"No"},{"$f":"IF(SellAllowed=\"Yes\",IF(AND(G1294 = \"Yes\", C1294<E1294), \"Yes\", \"No\"),\"No\")","v":"No"},{"$f":"IF(I1294 = \"Yes\", M1293/(C1294+CostBuy), IF(J1294 = \"Yes\", 0, K1293))","v":0},null,{"$f":"IF(I1294 = \"Yes\", M1293-(C1294+CostBuy)*K1294, IF(J1294=\"Yes\", M1293+(C1294-CostSell)*K1293, M1293+K1294*Rate))","v":20278122.586326193}]
[null,1977.1,93.74,98.546666666666667,99.11,null,"No",null,{"$f":"IF(BuyAllowed=\"Yes\",IF(AND(G1295 = \"No\", C1295>D1295), \"Yes\", \"No\"),\"No\")","v":"No"},{"$f":"IF(SellAllowed=\"Yes\",IF(AND(G1295 = \"Yes\", C1295<E1295), \"Yes\", \"No\"),\"No\")","v":"No"},{"$f":"IF(I1295 = \"Yes\", M1294/(C1295+CostBuy), IF(J1295 = \"Yes\", 0, K1294))","v":0},null,{"$f":"IF(I1295 = \"Yes\", M1294-(C1295+CostBuy)*K1295, IF(J1295=\"Yes\", M1294+(C1295-CostSell)*K1294, M1294+K1295*Rate))","v":20278122.586326193}]
[null,1977.11,94.28,97.661666666666676,98.202500000000001,null,"No",null,{"$f":"IF(BuyAllowed=\"Yes\",IF(AND(G1296 = \"No\", C1296>D1296), \"Yes\", \"No\"),\"No\")","v":"No"},{"$f":"IF(SellAllowed=\"Yes\",IF(AND(G1296 = \"Yes\", C1296<E1296), \"Yes\", \"No\"),\"No\")","v":"No"},{"$f":"IF(I1296 = \"Yes\", M1295/(C1296+CostBuy), IF(J1296 = \"Yes\", 0, K1295))","v":0},null,{"$f":"IF(I1296 = \"Yes\", M1295-(C1296+CostBuy)*K1296, IF(J1296=\"Yes\", M1295+(C1296-CostSell)*K1295, M1295+K1296*Rate))","v":20278122.586326193}]
[null,1977.12,93.82,96.915000000000006,97.412499999999994,null,"No",null,{"$f":"IF(BuyAllowed=\"Yes\",IF(AND(G1297 = \"No\", C1297>D1297), \"Yes\", \"No\"),\"No\")","v":"No"},{"$f":"IF(SellAllowed=\"Yes\",IF(AND(G1297 = \"Yes\", C1297<E1297), \"Yes\", \"No\"),\"No\")","v":"No"},{"$f":"IF(I1297 = \"Yes\", M1296/(C1297+CostBuy), IF(J1297 = \"Yes\", 0, K1296))","v":0},null,{"$f":"IF(I1297 = \"Yes\", M1296-(C1297+CostBuy)*K1297, IF(J1297=\"Yes\", M1296+(C1297-CostSell)*K1296, M1296+K1297*Rate))","v":20278122.586326193}]
[null,1978.01,90.25,96.00333333333333,96.758749999999992,null,"No",null,{"$f":"IF(BuyAllowed=\"Yes\",IF(AND(G1298 = \"No\", C1298>D1298), \"Yes\", \"No\"),\"No\")","v":"No"},{"$f":"IF(SellAllowed=\"Yes\",IF(AND(G1298 = \"Yes\", C1298<E1298), \"Yes\", \"No\"),\"No\")","v":"No"},{"$f":"IF(I1298 = \"Yes\", M1297/(C1298+CostBuy), IF(J1298 = \"Yes\", 0, K1297))","v":0},null,{"$f":"IF(I1298 = \"Yes\", M1297-(C1298+CostBuy)*K1298, IF(J1298=\"Yes\", M1297+(C1298-CostSell)*K1297, M1297+K1298*Rate))","v":20278122.586326193}]
[null,1978.02,88.98,94.344999999999985,95.694999999999993,null,"No",null,{"$f":"IF(BuyAllowed=\"Yes\",IF(AND(G1299 = \"No\", C1299>D1299), \"Yes\", \"No\"),\"No\")","v":"No"},{"$f":"IF(SellAllowed=\"Yes\",IF(AND(G1299 = \"Yes\", C1299<E1299), \"Yes\", \"No\"),\"No\")","v":"No"},{"$f":"IF(I1299 = \"Yes\", M1298/(C1299+CostBuy), IF(J1299 = \"Yes\", 0, K1298))","v":0},null,{"$f":"IF(I1299 = \"Yes\", M1298-(C1299+CostBuy)*K1299, IF(J1299=\"Yes\", M1298+(C1299-CostSell)*K1298, M1298+K1299*Rate))","v":20278122.586326193}]
[null,1978.03,88.82,92.883333333333326,94.40625,null,"No",null,{"$f":"IF(BuyAllowed=\"Yes\",IF(AND(G1300 = \"No\", C1300>D1300), \"Yes\", \"No\"),\"No\")","v":"No"},{"$f":"IF(SellAllowed=\"Yes\",IF(AND(G1300 = \"Yes\", C1300<E1300), \"Yes\", \"No\"),\"No\")","v":"No"},{"$f":"IF(I1300 = \"Yes\", M1299/(C1300+CostBuy), IF(J1300 = \"Yes\", 0, K1299))","v":0},null,{"$f":"IF(I1300 = \"Yes\", M1299-(C1300+CostBuy)*K1300, IF(J1300=\"Yes\", M1299+(C1300-CostSell)*K1299, M1299+K1300*Rate))","v":20278122.586326193}]
[null,1978.04,92.71,91.648333333333326,92.983749999999986,null,"No",null,{"$f":"IF(BuyAllowed=\"Yes\",IF(AND(G1301 = \"No\", C1301>D1301), \"Yes\", \"No\"),\"No\")","v":"Yes"},{"$f":"IF(SellAllowed=\"Yes\",IF(AND(G1301 = \"Yes\", C1301<E1301), \"Yes\", \"No\"),\"No\")","v":"No"},{"$f":"IF(I1301 = \"Yes\", M1300/(C1301+CostBuy), IF(J1301 = \"Yes\", 0, K1300))","v":218655.6241786305},null,{"$f":"IF(I1301 = \"Yes\", M1300-(C1301+CostBuy)*K1301, IF(J1301=\"Yes\", M1300+(C1301-CostSell)*K1300, M1300+K1301*Rate))","v":0}]
[null,1978.05,97.41,91.476666666666674,92.353749999999991,null,"Yes",null,{"$f":"IF(BuyAllowed=\"Yes\",IF(AND(G1302 = \"No\", C1302>D1302), \"Yes\", \"No\"),\"No\")","v":"No"},{"$f":"IF(SellAllowed=\"Yes\",IF(AND(G1302 = \"Yes\", C1302<E1302), \"Yes\", \"No\"),\"No\")","v":"No"},{"$f":"IF(I1302 = \"Yes\", M1301/(C1302+CostBuy), IF(J1302 = \"Yes\", 0, K1301))","v":218655.6241786305},null,{"$f":"IF(I1302 = \"Yes\", M1301-(C1302+CostBuy)*K1302, IF(J1302=\"Yes\", M1301+(C1302-CostSell)*K1301, M1301+K1302*Rate))","v":10932.781208931527}]
[null,1978.06,97.66,91.998333333333335,92.501249999999999,null,"Yes",null,{"$f":"IF(BuyAllowed=\"Yes\",IF(AND(G1303 = \"No\", C1303>D1303), \"Yes\", \"No\"),\"No\")","v":"No"},{"$f":"IF(SellAllowed=\"Yes\",IF(AND(G1303 = \"Yes\", C1303<E1303), \"Yes\", \"No\"),\"No\")","v":"No"},{"$f":"IF(I1303 = \"Yes\", M1302/(C1303+CostBuy), IF(J1303 = \"Yes\", 0, K1302))","v":218655.6241786305},null,{"$f":"IF(I1303 = \"Yes\", M1302-(C1303+CostBuy)*K1303, IF(J1303=\"Yes\", M1302+(C1303-CostSell)*K1302, M1302+K1303*Rate))","v":21865.562417863053}]
[null,1978.07,97.19,92.638333333333321,92.991249999999994,null,"Yes",null,{"$f":"IF(BuyAllowed=\"Yes\",IF(AND(G1304 = \"No\", C1304>D1304), \"Yes\", \"No\"),\"No\")","v":"No"},{"$f":"IF(SellAllowed=\"Yes\",IF(AND(G1304 = \"Yes\", C1304<E1304), \"Yes\", \"No\"),\"No\")","v":"No"},{"$f":"IF(I1304 = \"Yes\", M1303/(C1304+CostBuy), IF(J1304 = \"Yes\", 0, K1303))","v":218655.6241786305},null,{"$f":"IF(I1304 = \"Yes\", M1303-(C1304+CostBuy)*K1304, IF(J1304=\"Yes\", M1303+(C1304-CostSell)*K1303, M1303+K1304*Rate))","v":32798.34362679458}]
[null,1978.08,103.9,93.795000000000002,93.35499999999999,null,"Yes",null,{"$f":"IF(BuyAllowed=\"Yes\",IF(AND(G1305 = \"No\", C1305>D1305), \"Yes\", \"No\"),\"No\")","v":"No"},{"$f":"IF(SellAllowed=\"Yes\",IF(AND(G1305 = \"Yes\", C1305<E1305), \"Yes\", \"No\"),\"No\")","v":"No"},{"$f":"IF(I1305 = \"Yes\", M1304/(C1305+CostBuy), IF(J1305 = \"Yes\", 0, K1304))","v":218655.6241786305},null,{"$f":"IF(I1305 = \"Yes\", M1304-(C1305+CostBuy)*K1305, IF(J1305=\"Yes\", M1304+(C1305-CostSell)*K1304, M1304+K1305*Rate))","v":43731.124835726107}]
[null,1978.09,103.9,96.281666666666652,94.614999999999995,null,"Yes",null,{"$f":"IF(BuyAllowed=\"Yes\",IF(AND(G1306 = \"No\", C1306>D1306), \"Yes\", \"No\"),\"No\")","v":"No"},{"$f":"IF(SellAllowed=\"Yes\",IF(AND(G1306 = \"Yes\", C1306<E1306), \"Yes\", \"No\"),\"No\")","v":"No"},{"$f":"IF(I1306 = \"Yes\", M1305/(C1306+CostBuy), IF(J1306 = \"Yes\", 0, K1305))","v":218655.6241786305},null,{"$f":"IF(I1306 = \"Yes\", M1305-(C1306+CostBuy)*K1306, IF(J1306=\"Yes\", M1305+(C1306-CostSell)*K1305, M1305+K1306*Rate))","v":54663.906044657633}]
[null,1978.1,100.6,{"$f":"AVERAGE(C1301:C1306)","v":98.795000000000002},{"$f":"AVERAGE(C1299:C1306)","v":96.321249999999992},null,"Yes",null,{"$f":"IF(BuyAllowed=\"Yes\",IF(AND(G1307 = \"No\", C1307>D1307), \"Yes\", \"No\"),\"No\")","v":"No"},{"$f":"IF(SellAllowed=\"Yes\",IF(AND(G1307 = \"Yes\", C1307<E1307), \"Yes\", \"No\"),\"No\")","v":"No"},{"$f":"IF(I1307 = \"Yes\", M1306/(C1307+CostBuy), IF(J1307 = \"Yes\", 0, K1306))","v":218655.6241786305},null,{"$f":"IF(I1307 = \"Yes\", M1306-(C1307+CostBuy)*K1307, IF(J1307=\"Yes\", M1306+(C1307-CostSell)*K1306, M1306+K1307*Rate))","v":65596.68725358916}]
[null,1978.11,94.71,100.11,97.773749999999993,null,{"$f":"IF(I1307 = \"Yes\", \"Yes\", IF(J1307=\"Yes\", \"No\", G1307))","v":"Yes"},null,{"$f":"IF(BuyAllowed=\"Yes\",IF(AND(G1308 = \"No\", C1308>D1308), \"Yes\", \"No\"),\"No\")","v":"No"},{"$f":"IF(SellAllowed=\"Yes\",IF(AND(G1308 = \"Yes\", C1308<E1308), \"Yes\", \"No\"),\"No\")","v":"Yes"},{"$f":"IF(I1308 = \"Yes\", M1307/(C1308+CostBuy), IF(J1308 = \"Yes\", 0, K1307))","v":0},null,{"$f":"IF(I1308 = \"Yes\", M1307-(C1308+CostBuy)*K1308, IF(J1308=\"Yes\", M1307+(C1308-CostSell)*K1307, M1307+K1308*Rate))","v":20761351.515760966}]
[null,1978.12,96.11,99.660000000000011,98.51,null,"No",null,{"$f":"IF(BuyAllowed=\"Yes\",IF(AND(G1309 = \"No\", C1309>D1309), \"Yes\", \"No\"),\"No\")","v":"No"},{"$f":"IF(SellAllowed=\"Yes\",IF(AND(G1309 = \"Yes\", C1309<E1309), \"Yes\", \"No\"),\"No\")","v":"No"},{"$f":"IF(I1309 = \"Yes\", M1308/(C1309+CostBuy), IF(J1309 = \"Yes\", 0, K1308))","v":0},null,{"$f":"IF(I1309 = \"Yes\", M1308-(C1309+CostBuy)*K1309, IF(J1309=\"Yes\", M1308+(C1309-CostSell)*K1308, M1308+K1309*Rate))","v":20761351.515760966}]
[null,1979.01,99.71,99.401666666666657,98.935000000000002,null,"No",null,{"$f":"IF(BuyAllowed=\"Yes\",IF(AND(G1310 = \"No\", C1310>D1310), \"Yes\", \"No\"),\"No\")","v":"Yes"},{"$f":"IF(SellAllowed=\"Yes\",IF(AND(G1310 = \"Yes\", C1310<E1310), \"Yes\", \"No\"),\"No\")","v":"No"},{"$f":"IF(I1310 = \"Yes\", M1309/(C1310+CostBuy), IF(J1310 = \"Yes\", 0, K1309))","v":208154.71742290922},null,{"$f":"IF(I1310 = \"Yes\", M1309-(C1310+CostBuy)*K1310, IF(J1310=\"Yes\", M1309+(C1310-CostSell)*K1309, M1309+K1310*Rate))","v":0}]
[null,1979.02,98.23,99.821666666666658,99.222500000000011,null,"Yes",null,{"$f":"IF(BuyAllowed=\"Yes\",IF(AND(G1311 = \"No\", C1311>D1311), \"Yes\", \"No\"),\"No\")","v":"No"},{"$f":"IF(SellAllowed=\"Yes\",IF(AND(G1311 = \"Yes\", C1311<E1311), \"Yes\", \"No\"),\"No\")","v":"Yes"},{"$f":"IF(I1311 = \"Yes\", M1310/(C1311+CostBuy), IF(J1311 = \"Yes\", 0, K1310))","v":0},null,{"$f":"IF(I1311 = \"Yes\", M1310-(C1311+CostBuy)*K1311, IF(J1311=\"Yes\", M1310+(C1311-CostSell)*K1310, M1310+K1311*Rate))","v":20434548.609407}]
[null,1979.03,100.1,98.876666666666665,99.293750000000003,null,"No",null,{"$f":"IF(BuyAllowed=\"Yes\",IF(AND(G1312 = \"No\", C1312>D1312), \"Yes\", \"No\"),\"No\")","v":"Yes"},{"$f":"IF(SellAllowed=\"Yes\",IF(AND(G1312 = \"Yes\", C1312<E1312), \"Yes\", \"No\"),\"No\")","v":"No"},{"$f":"IF(I1312 = \"Yes\", M1311/(C1312+CostBuy), IF(J1312 = \"Yes\", 0, K1311))","v":204080.18185765506},null,{"$f":"IF(I1312 = \"Yes\", M1311-(C1312+CostBuy)*K1312, IF(J1312=\"Yes\", M1311+(C1312-CostSell)*K1311, M1311+K1312*Rate))","v":0}]
[null,1979.04,102.1,98.243333333333339,99.657499999999999,null,"Yes",null,{"$f":"IF(BuyAllowed=\"Yes\",IF(AND(G1313 = \"No\", C1313>D1313), \"Yes\", \"No\"),\"No\")","v":"No"},{"$f":"IF(SellAllowed=\"Yes\",IF(AND(G1313 = \"Yes\", C1313<E1313), \"Yes\", \"No\"),\"No\")","v":"No"},{"$f":"IF(I1313 = \"Yes\", M1312/(C1313+CostBuy), IF(J1313 = \"Yes\", 0, K1312))","v":204080.18185765506},null,{"$f":"IF(I1313 = \"Yes\", M1312-(C1313+CostBuy)*K1313, IF(J1313=\"Yes\", M1312+(C1313-CostSell)*K1312, M1312+K1313*Rate))","v":10204.009092882754}]
[null,1979.05,99.73,98.493333333333339,99.432500000000005,null,"Yes",null,{"$f":"IF(BuyAllowed=\"Yes\",IF(AND(G1314 = \"No\", C1314>D1314), \"Yes\", \"No\"),\"No\")","v":"No"},{"$f":"IF(SellAllowed=\"Yes\",IF(AND(G1314 = \"Yes\", C1314<E1314), \"Yes\", \"No\"),\"No\")","v":"No"},{"$f":"IF(I1314 = \"Yes\", M1313/(C1314+CostBuy), IF(J1314 = \"Yes\", 0, K1313))","v":204080.18185765506},null,{"$f":"IF(I1314 = \"Yes\", M1313-(C1314+CostBuy)*K1314, IF(J1314=\"Yes\", M1313+(C1314-CostSell)*K1313, M1313+K1314*Rate))","v":20408.018185765508}]
[null,1979.06,101.7,99.33,98.91125000000001,null,"Yes",null,{"$f":"IF(BuyAllowed=\"Yes\",IF(AND(G1315 = \"No\", C1315>D1315), \"Yes\", \"No\"),\"No\")","v":"No"},{"$f":"IF(SellAllowed=\"Yes\",IF(AND(G1315 = \"Yes\", C1315<E1315), \"Yes\", \"No\"),\"No\")","v":"No"},{"$f":"IF(I1315 = \"Yes\", M1314/(C1315+CostBuy), IF(J1315 = \"Yes\", 0, K1314))","v":204080.18185765506},null,{"$f":"IF(I1315 = \"Yes\", M1314-(C1315+CostBuy)*K1315, IF(J1315=\"Yes\", M1314+(C1315-CostSell)*K1314, M1314+K1315*Rate))","v":30612.02727864826}]
[null,1979.07,102.7,100.26166666666667,99.048750000000013,null,"Yes",null,{"$f":"IF(BuyAllowed=\"Yes\",IF(AND(G1316 = \"No\", C1316>D1316), \"Yes\", \"No\"),\"No\")","v":"No"},{"$f":"IF(SellAllowed=\"Yes\",IF(AND(G1316 = \"Yes\", C1316<E1316), \"Yes\", \"No\"),\"No\")","v":"No"},{"$f":"IF(I1316 = \"Yes\", M1315/(C1316+CostBuy), IF(J1316 = \"Yes\", 0, K1315))","v":204080.18185765506},null,{"$f":"IF(I1316 = \"Yes\", M1315-(C1316+CostBuy)*K1316, IF(J1316=\"Yes\", M1315+(C1316-CostSell)*K1315, M1315+K1316*Rate))","v":40816.036371531016}]
[null,1979.08,107.4,100.75999999999999,100.04750000000001,null,"Yes",null,{"$f":"IF(BuyAllowed=\"Yes\",IF(AND(G1317 = \"No\", C1317>D1317), \"Yes\", \"No\"),\"No\")","v":"No"},{"$f":"IF(SellAllowed=\"Yes\",IF(AND(G1317 = \"Yes\", C1317<E1317), \"Yes\", \"No\"),\"No\")","v":"No"},{"$f":"IF(I1317 = \"Yes\", M1316/(C1317+CostBuy), IF(J1317 = \"Yes\", 0, K1316))","v":204080.18185765506},null,{"$f":"IF(I1317 = \"Yes\", M1316-(C1317+CostBuy)*K1317, IF(J1317=\"Yes\", M1316+(C1317-CostSell)*K1316, M1316+K1317*Rate))","v":51020.045464413772}]
[null,1979.09,108.6,102.28833333333334,101.45875000000001,null,"Yes",null,{"$f":"IF(BuyAllowed=\"Yes\",IF(AND(G1318 = \"No\", C1318>D1318), \"Yes\", \"No\"),\"No\")","v":"No"},{"$f":"IF(SellAllowed=\"Yes\",IF(AND(G1318 = \"Yes\", C1318<E1318), \"Yes\", \"No\"),\"No\")","v":"No"},{"$f":"IF(I1318 = \"Yes\", M1317/(C1318+CostBuy), IF(J1318 = \"Yes\", 0, K1317))","v":204080.18185765506},null,{"$f":"IF(I1318 = \"Yes\", M1317-(C1318+CostBuy)*K1318, IF(J1318=\"Yes\", M1317+(C1318-CostSell)*K1317, M1317+K1318*Rate))","v":61224.054557296527}]
[null,1979.1,104.5,103.705,102.57,null,"Yes",null,{"$f":"IF(BuyAllowed=\"Yes\",IF(AND(G1319 = \"No\", C1319>D1319), \"Yes\", \"No\"),\"No\")","v":"No"},{"$f":"IF(SellAllowed=\"Yes\",IF(AND(G1319 = \"Yes\", C1319<E1319), \"Yes\", \"No\"),\"No\")","v":"No"},{"$f":"IF(I1319 = \"Yes\", M1318/(C1319+CostBuy), IF(J1319 = \"Yes\", 0, K1318))","v":204080.18185765506},null,{"$f":"IF(I1319 = \"Yes\", M1318-(C1319+CostBuy)*K1319, IF(J1319=\"Yes\", M1318+(C1319-CostSell)*K1318, M1318+K1319*Rate))","v":71428.063650179276}]
[null,1979.11,103.7,104.105,103.35375000000001,null,"Yes",null,{"$f":"IF(BuyAllowed=\"Yes\",IF(AND(G1320 = \"No\", C1320>D1320), \"Yes\", \"No\"),\"No\")","v":"No"},{"$f":"IF(SellAllowed=\"Yes\",IF(AND(G1320 = \"Yes\", C1320<E1320), \"Yes\", \"No\"),\"No\")","v":"No"},{"$f":"IF(I1320 = \"Yes\", M1319/(C1320+CostBuy), IF(J1320 = \"Yes\", 0, K1319))","v":204080.18185765506},null,{"$f":"IF(I1320 = \"Yes\", M1319-(C1320+CostBuy)*K1320, IF(J1320=\"Yes\", M1319+(C1320-CostSell)*K1319, M1319+K1320*Rate))","v":81632.072743062032}]
[null,1979.12,107.8,104.76666666666667,103.80375000000001,null,"Yes",null,{"$f":"IF(BuyAllowed=\"Yes\",IF(AND(G1321 = \"No\", C1321>D1321), \"Yes\", \"No\"),\"No\")","v":"No"},{"$f":"IF(SellAllowed=\"Yes\",IF(AND(G1321 = \"Yes\", C1321<E1321), \"Yes\", \"No\"),\"No\")","v":"No"},{"$f":"IF(I1321 = \"Yes\", M1320/(C1321+CostBuy), IF(J1321 = \"Yes\", 0, K1320))","v":204080.18185765506},null,{"$f":"IF(I1321 = \"Yes\", M1320-(C1321+CostBuy)*K1321, IF(J1321=\"Yes\", M1320+(C1321-CostSell)*K1320, M1320+K1321*Rate))","v":91836.081835944788}]
[null,1980.01,110.9,105.78333333333335,104.51625,null,"Yes",null,{"$f":"IF(BuyAllowed=\"Yes\",IF(AND(G1322 = \"No\", C1322>D1322), \"Yes\", \"No\"),\"No\")","v":"No"},{"$f":"IF(SellAllowed=\"Yes\",IF(AND(G1322 = \"Yes\", C1322<E1322), \"Yes\", \"No\"),\"No\")","v":"No"},{"$f":"IF(I1322 = \"Yes\", M1321/(C1322+CostBuy), IF(J1322 = \"Yes\", 0, K1321))","v":204080.18185765506},null,{"$f":"IF(I1322 = \"Yes\", M1321-(C1322+CostBuy)*K1322, IF(J1322=\"Yes\", M1321+(C1322-CostSell)*K1321, M1321+K1322*Rate))","v":102040.09092882754}]
[null,1980.02,115.3]
[null,1980.03,104.7]
[null,1980.04,103]
[null,1980.05,107.7]
[null,1980.06,114.6]
[null,1980.07,119.8]
[null,1980.08,123.5]
[null,1980.09,126.5]
[null,1980.1,130.19999999999999]
[null,1980.11,135.69999999999999]
[null,1980.12,133.5]
[null,1981.01,133]
[null,1981.02,128.4]
[null,1981.03,133.19999999999999]
[null,1981.04,134.4]
[null,1981.05,131.69999999999999]
[null,1981.06,132.30000000000001]
[null,1981.07,129.1]
[null,1981.08,129.6]
[null,1981.09,118.3]
[null,1981.1,119.8]
[null,1981.11,122.9]
[null,1981.12,123.8]
[null,1982.01,117.3]
[null,1982.02,114.5]
[null,1982.03,110.8]
[null,1982.04,116.3]
[null,1982.05,116.4]
[null,1982.06,109.7]
[null,1982.07,109.4]
[null,1982.08,109.7]
[null,1982.09,122.4]
[null,1982.1,132.69999999999999]
[null,1982.11,138.1]
[null,1982.12,139.4]
[null,1983.01,144.30000000000001]
[null,1983.02,146.80000000000001]
[null,1983.03,151.9]
[null,1983.04,157.69999999999999]
[null,1983.05,164.1]
[null,1983.06,166.4]
[null,1983.07,167]
[null,1983.08,162.4]
[null,1983.09,167.2]
[null,1983.1,167.7]
[null,1983.11,165.2]
[null,1983.12,164.4]
[null,1984.01,166.4]
[null,1984.02,157.30000000000001]
[null,1984.03,157.4]
[null,1984.04,157.6]
[null,1984.05,156.6]
[null,1984.06,153.1]
[null,1984.07,151.1]
[null,1984.08,164.4]
[null,1984.09,166.1]
[null,1984.1,164.8]
[null,1984.11,166.3]
[null,1984.12,164.5]
[null,1985.01,171.6]
[null,1985.02,180.9]
[null,1985.03,179.4]
[null,1985.04,180.6]
[null,1985.05,184.9]
[null,1985.06,188.9]
[null,1985.07,192.5]
[null,1985.08,188.3]
[null,1985.09,184.1]
[null,1985.1,186.2]
[null,1985.11,197.5]
[null,1985.12,207.3]
[null,1986.01,208.2]
[null,1986.02,219.4]
[null,1986.03,232.3]
[null,1986.04,238]
[null,1986.05,238.5]
[null,1986.06,245.3]
[null,1986.07,240.2]
[null,1986.08,245]
[null,1986.09,238.3]
[null,1986.1,237.4]
[null,1986.11,245.1]
[null,1986.12,248.6]
[null,1987.01,264.5]
[null,1987.02,280.89999999999998]
[null,1987.03,292.5]
[null,1987.04,289.3]
[null,1987.05,289.10000000000002]
[null,1987.06,301.39999999999998]
[null,1987.07,310.10000000000002]
[null,1987.08,329.4]
[null,1987.09,318.7]
[null,1987.1,280.2]
[null,1987.11,245]
[null,1987.12,241]
[null,1988.01,250.5]
[null,1988.02,258.10000000000002]
[null,1988.03,265.7]
[null,1988.04,262.60000000000002]
[null,1988.05,256.10000000000002]
[null,1988.06,270.7]
[null,1988.07,269.10000000000002]
[null,1988.08,263.7]
[null,1988.09,268]
[null,1988.1,277.39999999999998]
[null,1988.11,271]
[null,1988.12,276.5]
[null,1989.01,285.39999999999998]
[null,1989.02,294]
[null,1989.03,292.7]
[null,1989.04,302.3]
[null,1989.05,313.89999999999998]
[null,1989.06,323.7]
[null,1989.07,331.9]
[null,1989.08,346.6]
[null,1989.09,347.3]
[null,1989.1,347.4]
[null,1989.11,340.2]
[null,1989.12,348.6]
[null,1990.01,339.97]
[null,1990.02,330.45]
[null,1990.03,338.46]
[null,1990.04,338.18]
[null,1990.05,350.25]
[null,1990.06,360.39]
[null,1990.07,360.03]
[null,1990.08,330.75]
[null,1990.09,315.41000000000003]
[null,1990.1,307.12]
[null,1990.11,315.29000000000002]
[null,1990.12,328.75]
[null,1991.01,325.49]
[null,1991.02,362.26]
[null,1991.03,372.28]
[null,1991.04,379.68]
[null,1991.05,377.99]
[null,1991.06,378.29]
[null,1991.07,380.23]
[null,1991.08,389.4]
[null,1991.09,387.2]
[null,1991.1,386.88]
[null,1991.11,385.92]
[null,1991.12,388.51]
[null,1992.01,416.08]
[null,1992.02,412.56]
[null,1992.03,407.36]
[null,1992.04,407.41]
[null,1992.05,414.81]
[null,1992.06,408.27]
[null,1992.07,415.05]
[null,1992.08,417.93]
[null,1992.09,418.48]
[null,1992.1,412.5]
[null,1992.11,422.84]
[null,1992.12,435.64]
[null,1993.01,435.23]
[null,1993.02,441.7]
[null,1993.03,450.16]
[null,1993.04,443.08]
[null,1993.05,445.25]
[null,1993.06,448.06]
[null,1993.07,447.29]
[null,1993.08,454.13]
[null,1993.09,459.24]
[null,1993.1,463.9]
[null,1993.11,462.89]
[null,1993.12,465.95]
[null,1994.01,472.99]
[null,1994.02,471.58]
[null,1994.03,463.81]
[null,1994.04,447.23]
[null,1994.05,450.9]
[null,1994.06,454.83]
[null,1994.07,451.4]
[null,1994.08,464.24]
[null,1994.09,466.96]
[null,1994.1,463.81]
[null,1994.11,461.01]
[null,1994.12,455.19]
[null,1995.01,465.25]
[null,1995.02,481.92]
[null,1995.03,493.15]
[null,1995.04,507.91]
[null,1995.05,523.80999999999995]
[null,1995.06,539.35]
[null,1995.07,557.37]
[null,1995.08,559.11]
[null,1995.09,578.77]
[null,1995.1,582.91999999999996]
[null,1995.11,595.53]
[null,1995.12,614.57000000000005]
[null,1996.01,614.41999999999996]
[null,1996.02,649.54]
[null,1996.03,647.07000000000005]
[null,1996.04,647.16999999999996]
[null,1996.05,661.23]
[null,1996.06,668.5]
[null,1996.07,644.07000000000005]
[null,1996.08,662.68]
[null,1996.09,674.88]
[null,1996.1,701.46]
[null,1996.11,735.67]
[null,1996.12,743.25]
[null,1997.01,766.22]
[null,1997.02,798.39]
[null,1997.03,792.16]
[null,1997.04,763.93]
[null,1997.05,833.09]
[null,1997.06,876.29]
[null,1997.07,925.29]
[null,1997.08,927.24]
[null,1997.09,937.02]
[null,1997.1,951.16]
[null,1997.11,938.92]
[null,1997.12,962.37]
[null,1998.01,963.36]
[null,1998.02,1023.74]
[null,1998.03,1076.83]
[null,1998.04,1112.2]
[null,1998.05,1108.42]
[null,1998.06,1108.3900000000001]
[null,1998.07,1156.58]
[null,1998.08,1074.6199999999999]
[null,1998.09,1020.64]
[null,1998.1,1032.47]
[null,1998.11,1144.43]
[null,1998.12,1190.05]
[null,1999.01,1248.77]
[null,1999.02,1246.58]
[null,1999.03,1281.6600000000001]
[null,1999.04,1334.76]
[null,1999.05,1332.07]
[null,1999.06,1322.55]
[null,1999.07,1380.99]
[null,1999.08,1327.49]
[null,1999.09,1318.17]
[null,1999.1,1300.01]
[null,1999.11,1391]
[null,1999.12,1428.68]
[null,2000.01,1425.59]
[null,2000.02,1388.87]
[null,2000.03,1442.21]
[null,2000.04,1461.36]
[null,2000.05,1418.48]
[null,2000.06,1461.96]
[null,2000.07,1473]
[null,2000.08,1485.46]
[null,2000.09,1468.05]
[null,2000.1,1390.14]
[null,2000.11,1378.04]
[null,2000.12,1330.93]
[null,2001.01,1335.63]
[null,2001.02,1305.75]
[null,2001.03,1185.8499999999999]
[null,2001.04,1189.8399999999999]
[null,2001.05,1270.3699999999999]
[null,2001.06,1238.71]
[null,2001.07,1204.45]
[null,2001.08,1178.5]
[null,2001.09,1044.6400000000001]
[null,2001.1,1076.5899999999999]
[null,2001.11,1129.68]
[null,2001.12,1144.93]
[null,2002.01,1140.21]
[null,2002.02,1100.67]
[null,2002.03,1153.79]
[null,2002.04,1112.04]
[null,2002.05,1079.06]
[null,2002.06,1015.28]
[null,2002.07,903.59]
[null,2002.08,912.55]
[null,2002.09,867.81]
[null,2002.1,854.63]

{"sheet":"OutputA","index":2,"n_rows":25,"n_cols":9,"rows_kept":25,"cut":false,"hidden":true,"merged":[[10,1,10,2],[10,4,10,5],[17,1,17,2]]}
[]
[]
[]
[]
[]
[]
[]
[]
[]
[]
[null,"Risk Rate",null,null,"Time Horizon"]
[null,5]
[null,{"$f":"B12/100","v":0.05},null,null,"Year","Month",null,"At Max Profit",102040.09]
[null,null,null,"From:",null,null,null,"Number of Buys",48]
[null,null,null,"To:",null,null,null,"Number of Sales",48]
[]
[]
[null,"Possible Profits"]
[null,"X , Y",5,6,7,8,9,10]
[null,5,10233.790000000001,7079.46,6473.93,95934.6,62661.52,79071.97]
[null,6,8563.4599999999991,7657.79,7411.76,102040.09,66421.09,95071.75]
[null,7,6447.52,6015.4,5570.67,74798.37,46452.35,59905.42]
[null,8,6282.46,5864.61,5547.53,74487.710000000006,49013.22,63208.94]
[null,9,7222.25,7105.53,5552.11,92524.69,60874.79,80833.86]
[null,10,7203.04,7518.56,6884.64,85553.75,57997.05,87176.47]

{"sheet":"OutputB","index":3,"n_rows":12,"n_cols":10,"rows_kept":12,"cut":false,"hidden":true,"merged":[[10,8,10,9],[10,6,10,7],[10,3,10,5],[10,1,10,2]]}
[]
[]
[]
[]
[]
[]
[]
[]
[]
[]
[null,"Time Horizon",null,"SNP                                       (Buy and Sell)",null,null,"Buy and Hold               (No Sell)",null,"Sell and Hold          (No Buy)"]
[null,"From","To","X","Y","Profit","X","Profit","Y","Profit"]